program: Orca
programVersion: 5.0.2
elementType: O O O C C C C C C C C C C C C C C C C C C C C C C C H H H H H H H H H H H H H H H H H H H H H H H H H H
charge: 0
multiplicity: 1
keywords: wb97x-d3
keywords: def2-TZVPP
keywords: def2/J RIJCOSX
keywords: DEFGRID2
keywords: scfconv7
keywords: smallprint printgap noloewdin
keywords: NOSOSCF
formula: C23H26O3
InChI: InChI=1/C23H26O3/c1-16(2)13-20-21(23(20,3)4)22(24)25-15-17-9-8-12-19(14-17)26-18-10-6-5-7-11-18/h5-14,20-21H,15H2,1-4H3
52 atoms
O  -2.324654 1.895477 -1.138864
O  -1.943293 0.214475 -2.566549
O  2.920835 0.483589 -1.250444
C  -2.880805 -1.53494 -0.180049
C  -2.987504 -0.399203 0.81372
C  -3.302566 -0.172342 -0.643003
C  -3.943002 -2.603727 -0.133615
C  -1.509654 -2.060454 -0.527637
C  -1.795305 0.189457 1.481261
C  -2.440837 0.635247 -1.548536
C  -1.139647 -0.381913 2.496142
C  0.017135 0.302305 3.158477
C  -1.488674 -1.724384 3.058978
C  -1.373538 2.759504 -1.79157
C  -0.043931 2.61027 -1.111399
C  0.861057 1.63649 -1.527011
C  0.250182 3.381276 0.008306
C  2.031476 1.441108 -0.814254
C  1.432025 3.181519 0.708083
C  2.328638 2.203965 0.30564
C  3.059272 -0.655676 -0.500444
C  4.22018 -1.393109 -0.700971
C  2.093056 -1.091849 0.398058
C  4.411163 -2.571299 0.004113
C  2.300903 -2.273517 1.098197
C  3.456517 -3.017482 0.909877
H  -3.874384 -0.439093 1.441701
H  -4.355808 -0.046435 -0.884325
H  -4.916944 -2.194201 0.138044
H  -3.687827 -3.371805 0.599781
H  -4.048888 -3.095385 -1.102893
H  -1.19501 -2.796306 0.215579
H  -0.743901 -1.287083 -0.556842
H  -1.517024 -2.559429 -1.498397
H  -1.462667 1.170291 1.157101
H  -0.195705 0.494887 4.213433
H  0.259515 1.253384 2.683952
H  0.911542 -0.325462 3.134088
H  -2.342681 -2.188746 2.568606
H  -1.713945 -1.648105 4.12601
H  -0.638983 -2.407283 2.974494
H  -1.767235 3.765684 -1.661484
H  -1.318118 2.548303 -2.858785
H  0.657319 1.02613 -2.397607
H  -0.448427 4.141232 0.335736
H  1.656125 3.788523 1.575093
H  3.248523 2.038635 0.852488
H  4.96634 -1.044236 -1.403809
H  1.181028 -0.530661 0.557122
H  5.317906 -3.140768 -0.152888
H  1.542494 -2.61032 1.794391
H  3.612067 -3.935468 1.46062
elementType: O C H
totalener: -1117.84760602 hartree
nucrepener: 2405.92415008 hartree
electener: -3523.77175610 hartree
oneelecener: -6301.42457079 hartree
twoeener: 2777.65281469 hartree
cpcmener: -0.02997639 hartree
kineticenergy: 1112.79824351 hartree
xcener: -110.226941880345 hartree
chargesum: 0.0000000
charge: -0.281570 -0.475409 -0.347358 0.090699 -0.018201 -0.079826 -0.276614 -0.276304 -0.249112 0.397376 -0.042478 -0.252042 -0.260898 0.071573 -0.040922 -0.190849 -0.156510 0.261279 -0.177294 -0.155552 0.291275 -0.226869 -0.152255 -0.136333 -0.172769 -0.197363 0.109016 0.112960 0.088945 0.089800 0.096493 0.099217 0.058726 0.109560 0.126806 0.114285 0.091505 0.088502 0.092763 0.109312 0.097475 0.120952 0.121861 0.138300 0.145173 0.162084 0.158071 0.146384 0.086422 0.159324 0.171019 0.159367
qa: -0.2816 -0.4754 -0.3474 0.0907 -0.0182 -0.0798 -0.2766 -0.2763 -0.2491 0.3974 -0.0425 -0.2520 -0.2609 0.0716 -0.0409 -0.1908 -0.1565 0.2613 -0.1773 -0.1556 0.2913 -0.2269 -0.1523 -0.1363 -0.1728 -0.1974 0.1090 0.1130 0.0889 0.0898 0.0965 0.0992 0.0587 0.1096 0.1268 0.1143 0.0915 0.0885 0.0928 0.1093 0.0975 0.1210 0.1219 0.1383 0.1452 0.1621 0.1581 0.1464 0.0864 0.1593 0.1710 0.1594
va: 2.1245 2.0134 2.0604 3.7148 3.7763 3.8587 3.8988 3.9134 3.7955 4.1417 3.6903 3.9103 3.9273 3.8099 3.6247 3.9498 3.8764 3.7337 3.8579 3.9060 3.7199 3.9698 3.8036 3.9063 3.8796 3.9381 1.0052 1.0109 1.0045 1.0024 1.0023 0.9997 0.9878 1.0122 1.0089 1.0005 1.0067 0.9972 1.0061 1.0015 0.9977 0.9979 1.0144 1.0272 1.0024 0.9891 0.9952 1.0087 1.0457 0.9878 0.9825 0.9912
dispcorr: -0.032819312 hartree
energy: -1117.880425331399
dipole: -10.93344 10.50405 -0.42939 -13.19052 13.59055 0.40003 16.32359 -14.57680 1.74679
magnitude: 1.84274 au
magnitude: 4.68387 debye
