program: Orca
programVersion: 5.0.2
elementType: O O O C C C C C C C C C C C C C C C C C C C C C C C H H H H H H H H H H H H H H H H H H H H H H H H H H
charge: 0
multiplicity: 1
keywords: wb97x-d3
keywords: def2-TZVPP
keywords: def2/J RIJCOSX
keywords: DEFGRID2
keywords: scfconv7
keywords: smallprint printgap noloewdin
keywords: NOSOSCF
formula: C23H26O3
InChI: InChI=1/C23H26O3/c1-16(2)13-20-21(23(20,3)4)22(24)25-15-17-9-8-12-19(14-17)26-18-10-6-5-7-11-18/h5-14,20-21H,15H2,1-4H3
52 atoms
O  -1.293552 -1.346528 1.357027
O  -2.694421 0.348985 1.757357
O  3.122351 0.668406 -0.830952
C  -4.574662 -0.927516 -0.361333
C  -3.55659 -0.185707 -1.154721
C  -3.111101 -1.167161 -0.054848
C  -5.257816 -2.092039 -1.041595
C  -5.485746 -0.204998 0.599828
C  -3.336141 1.274023 -1.024998
C  -2.394688 -0.627454 1.108203
C  -2.189691 1.875557 -1.354913
C  -2.01781 3.35803 -1.24875
C  -1.000616 1.101085 -1.849709
C  -0.35139 -0.827282 2.30726
C  0.475338 0.264796 1.6882
C  1.435177 -0.069709 0.736958
C  0.269608 1.599713 2.019203
C  2.192066 0.929293 0.141754
C  1.022161 2.591152 1.405379
C  1.989599 2.262823 0.469017
C  3.939608 -0.429833 -0.744157
C  4.308097 -1.026688 -1.942346
C  4.43746 -0.901558 0.464589
C  5.181353 -2.104445 -1.928824
C  5.299675 -1.98892 0.462528
C  5.675647 -2.59575 -0.728376
H  -3.353393 -0.585302 -2.145418
H  -2.70881 -2.104124 -0.42095
H  -6.134636 -1.750614 -1.594767
H  -5.59309 -2.828913 -0.309506
H  -4.595518 -2.59649 -1.746074
H  -5.045807 0.67502 1.059356
H  -5.804626 -0.874411 1.400637
H  -6.38368 0.117294 0.068929
H  -4.162109 1.880379 -0.666364
H  -1.212666 3.604082 -0.550541
H  -2.925434 3.856771 -0.90932
H  -1.731905 3.790256 -2.211139
H  -1.178755 0.691712 -2.847467
H  -0.761112 0.254939 -1.203591
H  -0.112502 1.729369 -1.914548
H  0.270641 -1.680772 2.571767
H  -0.853865 -0.483311 3.211784
H  1.58724 -1.109031 0.469588
H  -0.472473 1.866072 2.760139
H  0.862942 3.629511 1.664329
H  2.583878 3.033036 -0.005815
H  3.916915 -0.646458 -2.877401
H  4.166088 -0.43201 1.401239
H  5.467113 -2.566183 -2.864767
H  5.684021 -2.357338 1.404524
H  6.349829 -3.441586 -0.720451
elementType: O C H
totalener: -1117.85138972 hartree
nucrepener: 2308.71002786 hartree
electener: -3426.56141758 hartree
oneelecener: -6107.66591569 hartree
twoeener: 2681.10449811 hartree
cpcmener: -0.03022885 hartree
kineticenergy: 1112.80080039 hartree
xcener: -110.228704237538 hartree
chargesum: -0.0000000
charge: -0.298109 -0.492346 -0.343712 0.134481 -0.023746 -0.099302 -0.266252 -0.295497 -0.278637 0.400133 -0.001843 -0.215516 -0.315020 0.084041 0.046089 -0.266580 -0.201762 0.317890 -0.143216 -0.250237 0.311818 -0.266934 -0.210196 -0.118585 -0.145706 -0.196261 0.115856 0.092073 0.095351 0.096008 0.088177 0.090488 0.101682 0.099589 0.127859 0.091005 0.088468 0.103335 0.121494 0.095361 0.102125 0.126411 0.116368 0.143429 0.141873 0.160853 0.147893 0.146769 0.157898 0.161363 0.161999 0.161276
qa: -0.2981 -0.4923 -0.3437 0.1345 -0.0237 -0.0993 -0.2663 -0.2955 -0.2786 0.4001 -0.0018 -0.2155 -0.3150 0.0840 0.0461 -0.2666 -0.2018 0.3179 -0.1432 -0.2502 0.3118 -0.2669 -0.2102 -0.1186 -0.1457 -0.1963 0.1159 0.0921 0.0954 0.0960 0.0882 0.0905 0.1017 0.0996 0.1279 0.0910 0.0885 0.1033 0.1215 0.0954 0.1021 0.1264 0.1164 0.1434 0.1419 0.1609 0.1479 0.1468 0.1579 0.1614 0.1620 0.1613
va: 2.0999 1.9921 2.0479 3.7644 3.7962 3.8379 3.8965 3.8879 3.8031 4.1083 3.6518 3.9122 3.9695 3.8125 3.5474 3.9242 3.8942 3.6179 3.8589 3.9681 3.6672 4.0130 3.9032 3.8761 3.8871 3.9047 1.0033 1.0336 1.0024 1.0024 1.0043 1.0180 1.0002 0.9985 0.9997 0.9940 1.0088 0.9940 1.0004 0.9947 1.0005 0.9951 1.0094 1.0110 1.0141 0.9889 1.0056 1.0092 0.9981 0.9880 0.9894 0.9896
dispcorr: -0.028242844 hartree
energy: -1117.879632564658
dipole: -20.73397 21.23990 0.50593 1.72338 -2.66742 -0.94404 -6.86632 6.51517 -0.35115
magnitude: 1.12716 au
magnitude: 2.86501 debye
