program: Orca
programVersion: 5.0.2
elementType: O O O C C C C C C C C C C C C C C C C C C C C C C C H H H H H H H H H H H H H H H H H H H H H H H H H H
charge: 0
multiplicity: 1
keywords: wb97x-d3
keywords: def2-TZVPP
keywords: def2/J RIJCOSX
keywords: DEFGRID2
keywords: scfconv7
keywords: smallprint printgap noloewdin
keywords: NOSOSCF
formula: C23H26O3
InChI: InChI=1/C23H26O3/c1-16(2)13-20-21(23(20,3)4)22(24)25-15-17-9-8-12-19(14-17)26-18-10-6-5-7-11-18/h5-14,20-21H,15H2,1-4H3
52 atoms
O  -1.990376 2.067033 0.62387
O  -2.913393 1.078501 -1.156071
O  3.179943 1.159677 0.795754
C  -4.611555 -0.536569 0.891914
C  -3.336932 -1.289304 0.744699
C  -3.304238 0.215744 1.047684
C  -5.374107 -0.717774 2.183731
C  -5.519591 -0.305593 -0.290456
C  -2.870878 -1.829316 -0.55667
C  -2.753561 1.133779 0.042189
C  -1.590499 -2.039425 -0.872508
C  -1.191306 -2.586901 -2.207506
C  -0.452696 -1.699958 0.038754
C  -1.210647 2.92449 -0.222525
C  0.033033 2.215753 -0.67867
C  1.048136 1.973993 0.24196
C  0.168993 1.755678 -1.983477
C  2.192195 1.294128 -0.1453
C  1.317187 1.07123 -2.359578
C  2.335931 0.834495 -1.449418
C  3.947473 0.019884 0.817906
C  3.371847 -1.244132 0.784276
C  5.320011 0.173735 0.940599
C  4.188726 -2.361838 0.870516
C  6.12477 -0.953721 1.035849
C  5.565258 -2.223242 0.996058
H  -3.040327 -1.875134 1.610741
H  -3.037092 0.471932 2.065975
H  -4.707499 -0.886537 3.03005
H  -6.046531 -1.574769 2.113966
H  -5.979832 0.162504 2.406385
H  -5.006294 -0.260712 -1.246231
H  -6.077531 0.624135 -0.167482
H  -6.247781 -1.116517 -0.348947
H  -3.631493 -2.076844 -1.291167
H  -0.622217 -3.513339 -2.098986
H  -0.538149 -1.883707 -2.731744
H  -2.051641 -2.789098 -2.844697
H  -0.764604 -1.467789 1.055299
H  0.095496 -0.835307 -0.346652
H  0.264054 -2.523004 0.084869
H  -0.961018 3.778318 0.405279
H  -1.799196 3.287679 -1.065282
H  0.957185 2.327334 1.262669
H  -0.614082 1.937017 -2.707851
H  1.425142 0.719515 -3.377083
H  3.230428 0.310239 -1.760866
H  2.298333 -1.35969 0.701289
H  5.753055 1.165551 0.967328
H  3.741847 -3.347049 0.845786
H  7.19581 -0.83477 1.133843
H  6.19624 -3.098961 1.066712
elementType: O C H
totalener: -1117.85302740 hartree
nucrepener: 2310.72320550 hartree
electener: -3428.57623290 hartree
oneelecener: -6111.51261272 hartree
twoeener: 2682.93637982 hartree
cpcmener: -0.03025395 hartree
kineticenergy: 1112.81088313 hartree
xcener: -110.230678833211 hartree
chargesum: 0.0000000
charge: -0.297183 -0.493906 -0.342421 0.136048 -0.018737 -0.111670 -0.265573 -0.299668 -0.264326 0.408082 -0.031655 -0.224595 -0.211228 0.089454 -0.007461 -0.247386 -0.176871 0.255547 -0.165972 -0.159814 0.175299 -0.109011 -0.190674 -0.221512 -0.159508 -0.144807 0.112743 0.092812 0.088291 0.094520 0.095737 0.091923 0.101779 0.099602 0.123711 0.096898 0.090903 0.091005 0.104515 0.021326 0.112435 0.125062 0.114923 0.133788 0.142094 0.161255 0.156489 0.199475 0.148628 0.157641 0.160687 0.161304
qa: -0.2972 -0.4939 -0.3424 0.1360 -0.0187 -0.1117 -0.2656 -0.2997 -0.2643 0.4081 -0.0317 -0.2246 -0.2112 0.0895 -0.0075 -0.2474 -0.1769 0.2555 -0.1660 -0.1598 0.1753 -0.1090 -0.1907 -0.2215 -0.1595 -0.1448 0.1127 0.0928 0.0883 0.0945 0.0957 0.0919 0.1018 0.0996 0.1237 0.0969 0.0909 0.0910 0.1045 0.0213 0.1124 0.1251 0.1149 0.1338 0.1421 0.1613 0.1565 0.1995 0.1486 0.1576 0.1607 0.1613
va: 2.1077 1.9917 2.0570 3.7429 3.8133 3.8420 3.8990 3.8923 3.8477 4.1011 3.7131 3.9256 3.9215 3.8010 3.6424 4.0194 3.8667 3.7300 3.8975 3.8520 3.7858 3.8196 3.9584 3.9634 3.9023 3.8619 1.0061 1.0316 1.0044 1.0022 1.0023 1.0162 1.0002 0.9984 0.9977 0.9975 0.9956 1.0071 1.0067 1.0237 1.0006 0.9962 1.0109 1.0205 1.0134 0.9914 0.9968 0.9476 1.0059 0.9950 0.9888 0.9891
dispcorr: -0.028427664 hartree
energy: -1117.881455065335
dipole: -18.27766 18.72180 0.44414 -13.96508 13.37059 -0.59449 -1.25467 1.81291 0.55824
magnitude: 0.92861 au
magnitude: 2.36033 debye
