program: Orca
programVersion: 5.0.2
elementType: O O O C C C C C C C C C C C C C C C C C C C C C C C H H H H H H H H H H H H H H H H H H H H H H H H H H
charge: 0
multiplicity: 1
keywords: wb97x-d3
keywords: def2-TZVPP
keywords: def2/J RIJCOSX
keywords: DEFGRID2
keywords: scfconv7
keywords: smallprint printgap noloewdin
keywords: NOSOSCF
formula: C23H26O3
InChI: InChI=1/C23H26O3/c1-16(2)13-20-21(23(20,3)4)22(24)25-15-17-9-8-12-19(14-17)26-18-10-6-5-7-11-18/h5-14,20-21H,15H2,1-4H3
52 atoms
O  -1.789707 2.134012 0.020776
O  -2.239644 0.67487 -1.614402
O  3.074401 0.813886 -0.461264
C  -3.305145 -1.20288 0.626636
C  -1.822994 -1.373956 0.757101
C  -2.429462 0.028891 0.698496
C  -4.137598 -1.456204 1.860805
C  -4.002223 -1.61447 -0.645886
C  -0.983047 -1.931103 -0.327647
C  -2.164616 0.930522 -0.434622
C  -0.427535 -3.147152 -0.299611
C  0.39527 -3.645449 -1.447815
C  -0.591013 -4.118388 0.829423
C  -1.298485 3.100215 -0.899986
C  0.199849 3.028719 -1.041469
C  0.923344 1.903342 -0.668192
C  0.867652 4.132675 -1.564788
C  2.307567 1.898084 -0.796264
C  2.245335 4.104401 -1.71132
C  2.977665 2.992871 -1.32112
C  2.661464 -0.073789 0.502716
C  2.122505 0.344607 1.713963
C  2.867267 -1.421384 0.246684
C  1.76964 -0.60526 2.661421
C  2.529574 -2.358732 1.213004
C  1.970761 -1.95809 2.417966
H  -1.484252 -1.621079 1.758934
H  -2.43777 0.541513 1.652959
H  -5.078988 -0.904894 1.817716
H  -3.617384 -1.158002 2.771787
H  -4.378034 -2.517479 1.947231
H  -4.358473 -2.640838 -0.538364
H  -3.367726 -1.586484 -1.526905
H  -4.873987 -0.986131 -0.835517
H  -0.818995 -1.326074 -1.211957
H  -0.028066 -4.565221 -1.860456
H  1.409871 -3.89283 -1.125054
H  0.464846 -2.915462 -2.253928
H  -1.316345 -4.892552 0.563396
H  -0.933901 -3.657431 1.754536
H  0.348069 -4.634175 1.039661
H  -1.583103 4.06969 -0.49184
H  -1.783696 3.003499 -1.872956
H  0.430561 1.030219 -0.262252
H  0.309857 5.016203 -1.8503
H  2.761504 4.964555 -2.116718
H  4.055451 2.976243 -1.419209
H  1.975371 1.396578 1.922417
H  3.291207 -1.733708 -0.699336
H  1.342235 -0.279814 3.600756
H  2.692352 -3.409661 1.012578
H  1.696665 -2.69287 3.162979
elementType: O C H
totalener: -1117.85203852 hartree
nucrepener: 2385.95182988 hartree
electener: -3503.80386840 hartree
oneelecener: -6261.98567879 hartree
twoeener: 2758.18181039 hartree
cpcmener: -0.03108013 hartree
kineticenergy: 1112.79065965 hartree
xcener: -110.233160063928 hartree
chargesum: -0.0000000
charge: -0.295159 -0.485021 -0.336652 0.197169 -0.051512 -0.121756 -0.269615 -0.300313 -0.297260 0.392163 -0.014185 -0.236805 -0.283970 0.084539 0.025130 -0.199637 -0.246835 0.316256 -0.108545 -0.267734 0.324678 -0.202941 -0.284680 -0.145463 -0.095498 -0.200573 0.115654 0.099719 0.095469 0.089281 0.094112 0.095733 0.095152 0.105814 0.128958 0.108362 0.086060 0.093792 0.116690 0.094697 0.095810 0.126889 0.115833 0.105287 0.144752 0.159851 0.146699 0.158747 0.146955 0.161089 0.162411 0.160407
qa: -0.2952 -0.4850 -0.3367 0.1972 -0.0515 -0.1218 -0.2696 -0.3003 -0.2973 0.3922 -0.0142 -0.2368 -0.2840 0.0845 0.0251 -0.1996 -0.2468 0.3163 -0.1085 -0.2677 0.3247 -0.2029 -0.2847 -0.1455 -0.0955 -0.2006 0.1157 0.0997 0.0955 0.0893 0.0941 0.0957 0.0952 0.1058 0.1290 0.1084 0.0861 0.0938 0.1167 0.0947 0.0958 0.1269 0.1158 0.1053 0.1448 0.1599 0.1467 0.1587 0.1470 0.1611 0.1624 0.1604
va: 2.1156 2.0010 2.0781 3.7164 3.7745 3.9607 3.8982 3.9043 3.7472 4.1097 3.7195 3.9130 3.9347 3.8332 3.6666 3.9152 3.9698 3.7059 3.8838 3.9951 3.6312 3.8912 3.9798 3.8544 3.7755 3.8688 0.9988 1.0306 1.0021 1.0044 1.0025 1.0015 1.0129 1.0001 1.0166 0.9978 0.9968 1.0060 0.9993 1.0051 0.9980 0.9933 1.0143 1.0125 1.0003 0.9879 1.0083 0.9944 1.0090 0.9896 0.9844 0.9911
dispcorr: -0.030253127 hartree
energy: -1117.882291643113
dipole: -14.45351 14.06938 -0.38413 -21.39709 21.25824 -0.13885 4.56506 -3.17165 1.39341
magnitude: 1.45204 au
magnitude: 3.69079 debye
