program: Orca
programVersion: 5.0.2
elementType: O O O C C C C C C C C C C C C C C C C C C C C C C C H H H H H H H H H H H H H H H H H H H H H H H H H H
charge: 0
multiplicity: 1
keywords: wb97x-d3
keywords: def2-TZVPP
keywords: def2/J RIJCOSX
keywords: DEFGRID2
keywords: scfconv7
keywords: smallprint printgap noloewdin
keywords: NOSOSCF
formula: C23H26O3
InChI: InChI=1/C23H26O3/c1-16(2)13-20-21(23(20,3)4)22(24)25-15-17-9-8-12-19(14-17)26-18-10-6-5-7-11-18/h5-14,20-21H,15H2,1-4H3
52 atoms
O  -1.93552 1.39807 -1.813745
O  -0.961753 -0.551732 -1.316102
O  3.427765 1.100074 0.011052
C  -3.754435 -1.387086 -0.214742
C  -3.074697 -0.710164 0.930771
C  -3.13384 -0.024515 -0.445429
C  -5.265358 -1.389529 -0.198428
C  -3.184789 -2.63487 -0.842674
C  -1.824562 -1.208954 1.536796
C  -1.904712 0.201206 -1.217908
C  -1.364795 -0.88441 2.751746
C  -0.121733 -1.523115 3.294293
C  -2.0051 0.098846 3.683976
C  -0.744929 1.850145 -2.478665
C  0.283026 2.274301 -1.469664
C  1.413402 1.499031 -1.252222
C  0.072512 3.418111 -0.703745
C  2.303215 1.843297 -0.243576
C  0.985174 3.770867 0.277435
C  2.0980 2.978509 0.525088
C  3.361874 -0.270636 -0.052222
C  2.261721 -0.98616 0.408021
C  4.475152 -0.928881 -0.554971
C  2.284037 -2.372075 0.344887
C  4.488372 -2.316025 -0.595993
C  3.392194 -3.043645 -0.154188
H  -3.751238 -0.231352 1.629572
H  -3.839176 0.795948 -0.503085
H  -5.638908 -2.247699 0.363518
H  -5.666332 -1.45562 -1.211588
H  -5.669584 -0.488249 0.263573
H  -2.100496 -2.6856 -0.849041
H  -3.523349 -2.72443 -1.876345
H  -3.551171 -3.510082 -0.303003
H  -1.252262 -1.937998 0.97432
H  0.650376 -0.775456 3.493472
H  0.294292 -2.26675 2.615479
H  -0.32435 -2.016737 4.248629
H  -2.852998 0.629705 3.255804
H  -1.274994 0.846438 4.004804
H  -2.347577 -0.403373 4.593143
H  -1.074224 2.694667 -3.081683
H  -0.358992 1.083344 -3.15152
H  1.584509 0.619575 -1.860262
H  -0.802947 4.032149 -0.875238
H  0.825122 4.661594 0.870363
H  2.800497 3.240055 1.306031
H  1.393268 -0.479455 0.810973
H  5.324983 -0.358986 -0.908824
H  1.425672 -2.929193 0.697805
H  5.358951 -2.826554 -0.986337
H  3.401298 -4.124451 -0.195877
elementType: O C H
totalener: -1117.85323281 hartree
nucrepener: 2345.30154611 hartree
electener: -3463.15477892 hartree
oneelecener: -6181.26037573 hartree
twoeener: 2718.10559680 hartree
cpcmener: -0.03032193 hartree
kineticenergy: 1112.79942030 hartree
xcener: -110.228802710977 hartree
chargesum: 0.0000000
charge: -0.297018 -0.504234 -0.343689 0.106133 0.025387 -0.092583 -0.261011 -0.289887 -0.298773 0.422813 -0.029395 -0.249138 -0.266305 0.093046 0.000475 -0.183671 -0.246651 0.276509 -0.115225 -0.251889 0.281577 -0.189889 -0.249607 -0.136605 -0.128354 -0.194334 0.113670 0.095878 0.095139 0.094473 0.088291 0.094122 0.101313 0.099661 0.124863 0.097658 0.091684 0.109756 0.091413 0.095595 0.099954 0.128815 0.114675 0.141480 0.146340 0.161742 0.148947 0.154331 0.148078 0.162361 0.160822 0.161254
qa: -0.2970 -0.5042 -0.3437 0.1061 0.0254 -0.0926 -0.2610 -0.2899 -0.2988 0.4228 -0.0294 -0.2491 -0.2663 0.0930 0.0005 -0.1837 -0.2467 0.2765 -0.1152 -0.2519 0.2816 -0.1899 -0.2496 -0.1366 -0.1284 -0.1943 0.1137 0.0959 0.0951 0.0945 0.0883 0.0941 0.1013 0.0997 0.1249 0.0977 0.0917 0.1098 0.0914 0.0956 0.1000 0.1288 0.1147 0.1415 0.1463 0.1617 0.1489 0.1543 0.1481 0.1624 0.1608 0.1613
va: 2.1173 1.9814 2.0686 3.7491 3.7355 3.8410 3.8981 3.8937 3.8675 4.0748 3.7149 3.9230 3.9483 3.8036 3.6053 3.8884 3.9753 3.7136 3.8758 4.0226 3.7415 3.8936 4.0001 3.8648 3.8856 3.9346 1.0026 1.0300 1.0018 1.0025 1.0049 1.0195 0.9992 0.9994 0.9993 0.9941 1.0072 0.9995 1.0093 0.9977 0.9959 0.9929 1.0101 1.0169 1.0047 0.9872 1.0052 0.9875 1.0072 0.9914 0.9876 0.9901
dispcorr: -0.027380392 hartree
energy: -1117.880613204644
dipole: -19.65408 18.35406 -1.30002 -11.84029 12.20696 0.36667 12.20980 -11.87695 0.33285
magnitude: 1.39115 au
magnitude: 3.53601 debye
