program: Orca
programVersion: 5.0.2
elementType: O O O C C C C C C C C C C C C C C C C C C C C C C C H H H H H H H H H H H H H H H H H H H H H H H H H H
charge: 0
multiplicity: 1
keywords: wb97x-d3
keywords: def2-TZVPP
keywords: def2/J RIJCOSX
keywords: DEFGRID2
keywords: scfconv7
keywords: smallprint printgap noloewdin
keywords: NOSOSCF
formula: C23H26O3
InChI: InChI=1/C23H26O3/c1-16(2)13-20-21(23(20,3)4)22(24)25-15-17-9-8-12-19(14-17)26-18-10-6-5-7-11-18/h5-14,20-21H,15H2,1-4H3
52 atoms
O  -1.95795 1.387541 -1.783899
O  -0.978756 -0.557348 -1.277784
O  3.402894 1.08245 0.069826
C  -3.776355 -1.418693 -0.224192
C  -3.102719 -0.757598 0.932044
C  -3.162931 -0.04842 -0.432664
C  -5.28745 -1.427606 -0.211324
C  -3.200144 -2.651592 -0.87496
C  -1.845186 -1.253362 1.528897
C  -1.927931 0.189165 -1.190992
C  -1.312944 -0.827441 2.680933
C  -0.073851 -1.46316 3.235274
C  -1.86263 0.284287 3.520323
C  -0.7609 1.8468 -2.43185
C  0.259145 2.261386 -1.410572
C  1.391727 1.487913 -1.197597
C  0.040499 3.394531 -0.631199
C  2.275667 1.822835 -0.180706
C  0.947504 3.738526 0.35846
C  2.062435 2.947725 0.601076
C  3.349145 -0.28738 -0.016666
C  2.248859 -1.019509 0.415727
C  4.47538 -0.928362 -0.51302
C  2.28387 -2.403995 0.331939
C  4.500524 -2.314471 -0.576541
C  3.404431 -3.058357 -0.162213
H  -3.781682 -0.294213 1.639467
H  -3.87137 0.769827 -0.483119
H  -5.68621 -1.479178 -1.226149
H  -5.696398 -0.535524 0.264197
H  -5.658336 -2.296133 0.33626
H  -2.115611 -2.698467 -0.876769
H  -3.5336 -2.720591 -1.911863
H  -3.566275 -3.539058 -0.355569
H  -1.335988 -2.063956 1.019243
H  0.290079 -2.277297 2.609189
H  -0.258013 -1.865456 4.235047
H  0.730776 -0.73127 3.341898
H  -2.747649 0.759522 3.102662
H  -1.107057 1.061663 3.65786
H  -2.114868 -0.077157 4.52025
H  -1.084681 2.697332 -3.02943
H  -0.368484 1.087002 -3.108923
H  1.568714 0.616789 -1.815817
H  -0.836105 4.00782 -0.799392
H  0.78156 4.621368 0.961479
H  2.760162 3.201919 1.388718
H  1.369534 -0.526992 0.812154
H  5.325816 -0.346113 -0.844569
H  1.424767 -2.972751 0.664017
H  5.380973 -2.811434 -0.962206
H  3.423312 -4.138218 -0.221353
elementType: O C H
totalener: -1117.85322579 hartree
nucrepener: 2352.65558117 hartree
electener: -3470.50880696 hartree
oneelecener: -6195.98813399 hartree
twoeener: 2725.47932704 hartree
cpcmener: -0.03039013 hartree
kineticenergy: 1112.80417179 hartree
xcener: -110.229970184985 hartree
chargesum: 0.0000000
charge: -0.297525 -0.503920 -0.343265 0.111717 0.003520 -0.081631 -0.259290 -0.292904 -0.289246 0.416733 -0.024696 -0.255564 -0.264213 0.093315 0.002313 -0.185955 -0.247347 0.280593 -0.115067 -0.254212 0.283669 -0.193520 -0.248240 -0.133540 -0.128452 -0.193983 0.113200 0.095363 0.094676 0.088438 0.094969 0.093696 0.101635 0.100639 0.127617 0.093000 0.112103 0.096886 0.090157 0.096460 0.098197 0.128656 0.114699 0.140646 0.146361 0.161836 0.148912 0.152059 0.147950 0.160835 0.160699 0.161021
qa: -0.2975 -0.5039 -0.3433 0.1117 0.0035 -0.0816 -0.2593 -0.2929 -0.2892 0.4167 -0.0247 -0.2556 -0.2642 0.0933 0.0023 -0.1860 -0.2473 0.2806 -0.1151 -0.2542 0.2837 -0.1935 -0.2482 -0.1335 -0.1285 -0.1940 0.1132 0.0954 0.0947 0.0884 0.0950 0.0937 0.1016 0.1006 0.1276 0.0930 0.1121 0.0969 0.0902 0.0965 0.0982 0.1287 0.1147 0.1406 0.1464 0.1618 0.1489 0.1521 0.1480 0.1608 0.1607 0.1610
va: 2.1173 1.9804 2.0702 3.7664 3.7512 3.8410 3.8945 3.8939 3.8557 4.0765 3.6988 3.9256 3.9489 3.8044 3.6006 3.8892 3.9746 3.7090 3.8744 4.0222 3.7394 3.8919 3.9976 3.8636 3.8853 3.9324 1.0033 1.0299 1.0026 1.0048 1.0020 1.0197 0.9992 0.9992 0.9999 1.0063 0.9998 0.9927 1.0092 0.9976 0.9968 0.9928 1.0097 1.0169 1.0047 0.9871 1.0053 0.9858 1.0073 0.9926 0.9876 0.9902
dispcorr: -0.027713749 hartree
energy: -1117.880939539404
dipole: -19.25991 17.98080 -1.27912 -11.41775 11.80469 0.38694 11.53090 -11.22659 0.30431
magnitude: 1.37057 au
magnitude: 3.48372 debye
