program: Orca
programVersion: 5.0.2
elementType: O O O C C C C C C C C C C C C C C C C C C C C C C C H H H H H H H H H H H H H H H H H H H H H H H H H H
charge: 0
multiplicity: 1
keywords: wb97x-d3
keywords: def2-TZVPP
keywords: def2/J RIJCOSX
keywords: DEFGRID2
keywords: scfconv7
keywords: smallprint printgap noloewdin
keywords: NOSOSCF
formula: C23H26O3
InChI: InChI=1/C23H26O3/c1-16(2)13-20-21(23(20,3)4)22(24)25-15-17-9-8-12-19(14-17)26-18-10-6-5-7-11-18/h5-14,20-21H,15H2,1-4H3
52 atoms
O  -1.994344 1.541525 -1.140637
O  -1.681705 -0.629608 -1.604862
O  2.806526 1.190512 0.983617
C  -4.298897 -1.098799 0.012202
C  -3.193618 -1.135225 1.007042
C  -3.299831 0.044822 0.031418
C  -5.672297 -0.730793 0.523664
C  -4.351757 -2.082597 -1.129725
C  -2.076625 -2.107439 0.92936
C  -2.259646 0.237216 -0.988612
C  -0.874604 -1.924695 1.482009
C  0.202806 -2.957025 1.358642
C  -0.499565 -0.68886 2.241325
C  -0.988575 1.958562 -2.070176
C  0.250941 2.414085 -1.353114
C  0.951197 1.544961 -0.519486
C  0.714386 3.712155 -1.535904
C  2.110718 1.981111 0.104417
C  1.873996 4.136996 -0.902898
C  2.581917 3.273391 -0.083496
C  3.15741 -0.094949 0.67066
C  3.286918 -0.560673 -0.632042
C  3.440869 -0.924956 1.749323
C  3.689073 -1.873616 -0.842718
C  3.853867 -2.228115 1.521176
C  3.973993 -2.712786 0.224987
H  -3.470348 -0.840789 2.015683
H  -3.665469 0.967664 0.465401
H  -5.622541 -0.011371 1.342005
H  -6.192769 -1.617387 0.890888
H  -6.281142 -0.293777 -0.269933
H  -4.879782 -1.649437 -1.981008
H  -4.909236 -2.967895 -0.817169
H  -3.379319 -2.417187 -1.478643
H  -2.262903 -3.035921 0.398202
H  0.613255 -3.227468 2.33457
H  1.03805 -2.568569 0.769326
H  -0.153311 -3.866565 0.875138
H  -0.442869 -0.898789 3.313898
H  -1.202148 0.132201 2.100976
H  0.491874 -0.336316 1.948374
H  -1.420345 2.784843 -2.63428
H  -0.756701 1.160738 -2.775884
H  0.603813 0.529887 -0.365991
H  0.167354 4.393263 -2.17572
H  2.23058 5.147874 -1.049146
H  3.487321 3.597145 0.413443
H  3.086074 0.080536 -1.480296
H  3.338206 -0.548274 2.759226
H  3.787015 -2.234979 -1.858166
H  4.072824 -2.869702 2.364635
H  4.287778 -3.732912 0.049078
elementType: O C H
totalener: -1117.85251452 hartree
nucrepener: 2345.52297576 hartree
electener: -3463.37549028 hartree
oneelecener: -6181.19259390 hartree
twoeener: 2717.81710362 hartree
cpcmener: -0.02951689 hartree
kineticenergy: 1112.78875134 hartree
xcener: -110.228932976156 hartree
chargesum: 0.0000000
charge: -0.298048 -0.497476 -0.341547 0.133265 -0.020678 -0.114796 -0.264924 -0.300574 -0.266319 0.421001 0.007226 -0.223859 -0.279338 0.082190 -0.018467 -0.200850 -0.214399 0.297134 -0.112832 -0.243831 0.321182 -0.211344 -0.276243 -0.134419 -0.118340 -0.201471 0.115128 0.094446 0.088555 0.094858 0.095980 0.102022 0.100858 0.091598 0.126405 0.102332 0.058639 0.097452 0.120452 0.102997 0.066590 0.112768 0.116325 0.151030 0.145317 0.161362 0.148352 0.156831 0.147925 0.161900 0.158701 0.158931
qa: -0.2980 -0.4975 -0.3415 0.1333 -0.0207 -0.1148 -0.2649 -0.3006 -0.2663 0.4210 0.0072 -0.2239 -0.2793 0.0822 -0.0185 -0.2009 -0.2144 0.2971 -0.1128 -0.2438 0.3212 -0.2113 -0.2762 -0.1344 -0.1183 -0.2015 0.1151 0.0944 0.0886 0.0949 0.0960 0.1020 0.1009 0.0916 0.1264 0.1023 0.0586 0.0975 0.1205 0.1030 0.0666 0.1128 0.1163 0.1510 0.1453 0.1614 0.1484 0.1568 0.1479 0.1619 0.1587 0.1589
va: 2.1141 1.9823 2.0533 3.7498 3.8123 3.8576 3.8964 3.8963 3.8376 4.0755 3.6407 3.9380 3.9477 3.8164 3.7692 3.9385 3.9478 3.6564 3.8888 4.0324 3.6210 3.8865 3.9301 3.8698 3.8359 3.8863 1.0028 1.0318 1.0043 1.0019 1.0025 1.0000 0.9980 1.0169 1.0002 0.9931 1.0031 1.0139 1.0000 1.0063 1.0012 1.0017 1.0183 0.9916 1.0035 0.9877 1.0056 0.9975 1.0094 0.9891 0.9898 0.9908
dispcorr: -0.029174595 hartree
energy: -1117.881689115644
dipole: -16.32891 15.86067 -0.46823 -13.22335 13.85329 0.62994 4.90722 -4.79296 0.11426
magnitude: 0.79317 au
magnitude: 2.01608 debye
