program: Orca
programVersion: 5.0.2
elementType: O O O C C C C C C C C C C C C C C C C C C C C C C C H H H H H H H H H H H H H H H H H H H H H H H H H H
charge: 0
multiplicity: 1
keywords: wb97x-d3
keywords: def2-TZVPP
keywords: def2/J RIJCOSX
keywords: DEFGRID2
keywords: scfconv7
keywords: smallprint printgap noloewdin
keywords: NOSOSCF
formula: C23H26O3
InChI: InChI=1/C23H26O3/c1-16(2)13-20-21(23(20,3)4)22(24)25-15-17-9-8-12-19(14-17)26-18-10-6-5-7-11-18/h5-14,20-21H,15H2,1-4H3
52 atoms
O  -1.894541 0.116066 -1.203526
O  -3.017881 2.043598 -1.2336
O  3.073377 0.620409 0.870474
C  -4.372281 -1.156104 0.048634
C  -3.563521 -0.671599 1.201563
C  -3.892289 0.285617 0.056395
C  -5.859507 -1.318019 0.260985
C  -3.80991 -2.177824 -0.908958
C  -2.206562 -1.195372 1.503769
C  -2.903259 0.897849 -0.846877
C  -1.209837 -0.502902 2.060926
C  0.078343 -1.166112 2.442075
C  -1.284673 0.961784 2.361742
C  -0.866446 0.656022 -2.051606
C  0.168828 1.383645 -1.243173
C  1.156895 0.650618 -0.594058
C  0.138348 2.76844 -1.105991
C  2.107965 1.304323 0.177178
C  1.086034 3.408268 -0.320811
C  2.077734 2.683237 0.322603
C  3.717105 -0.434986 0.274712
C  3.992989 -1.539965 1.06704
C  4.135899 -0.387315 -1.049253
C  4.700909 -2.605402 0.527927
C  4.833541 -1.464198 -1.576983
C  5.119625 -2.575495 -0.794856
H  -4.141299 -0.424773 2.089372
H  -4.664827 1.006138 0.298027
H  -6.402794 -1.216968 -0.680406
H  -6.254387 -0.576094 0.956082
H  -6.081706 -2.306397 0.668225
H  -4.207478 -2.025579 -1.913749
H  -4.114596 -3.175435 -0.586962
H  -2.725697 -2.17975 -0.97462
H  -2.049679 -2.253766 1.313799
H  0.21977 -1.138407 3.525932
H  0.936364 -0.647932 2.010183
H  0.115702 -2.208283 2.125421
H  -2.245946 1.405385 2.108539
H  -0.508294 1.504619 1.814368
H  -1.097733 1.149229 3.422164
H  -1.29535 1.294892 -2.823224
H  -0.4310 -0.214682 -2.537956
H  1.179802 -0.428404 -0.695715
H  -0.618405 3.348655 -1.616158
H  1.061746 4.484741 -0.216059
H  2.824056 3.181429 0.92802
H  3.6591 -1.562858 2.096665
H  3.928503 0.478124 -1.6653
H  4.918845 -3.465056 1.147622
H  5.15962 -1.427964 -2.607926
H  5.666697 -3.409736 -1.212971
elementType: O C H
totalener: -1117.85043048 hartree
nucrepener: 2341.03498758 hartree
electener: -3458.88541806 hartree
oneelecener: -6171.79722090 hartree
twoeener: 2712.91180284 hartree
cpcmener: -0.02974000 hartree
kineticenergy: 1112.80813336 hartree
xcener: -110.230805821525 hartree
chargesum: -0.0000000
charge: -0.266446 -0.510831 -0.348385 0.149089 -0.015281 -0.163037 -0.270251 -0.297679 -0.266305 0.446015 -0.033931 -0.208481 -0.249192 0.052975 -0.013894 -0.182470 -0.172415 0.263497 -0.140780 -0.239008 0.282299 -0.251567 -0.180373 -0.127195 -0.156244 -0.185774 0.115476 0.095691 0.095506 0.087671 0.093796 0.104862 0.097541 0.093626 0.123815 0.107221 0.058106 0.094319 0.098580 0.072021 0.111962 0.122426 0.118244 0.147836 0.143764 0.159887 0.149239 0.152052 0.157078 0.161196 0.162277 0.161473
qa: -0.2664 -0.5108 -0.3484 0.1491 -0.0153 -0.1630 -0.2703 -0.2977 -0.2663 0.4460 -0.0339 -0.2085 -0.2492 0.0530 -0.0139 -0.1825 -0.1724 0.2635 -0.1408 -0.2390 0.2823 -0.2516 -0.1804 -0.1272 -0.1562 -0.1858 0.1155 0.0957 0.0955 0.0877 0.0938 0.1049 0.0975 0.0936 0.1238 0.1072 0.0581 0.0943 0.0986 0.0720 0.1120 0.1224 0.1182 0.1478 0.1438 0.1599 0.1492 0.1521 0.1571 0.1612 0.1623 0.1615
va: 2.1185 1.9857 2.0255 3.7048 3.7955 3.8592 3.9061 3.9017 3.8405 4.0909 3.7018 3.9132 3.9418 3.8217 3.6304 3.8716 3.9118 3.6370 3.9332 4.0178 3.6855 3.9802 3.8974 3.8895 3.8925 3.8977 1.0041 1.0291 1.0014 1.0054 1.0019 1.0006 0.9988 1.0089 1.0003 0.9991 1.0054 1.0072 1.0064 1.0100 1.0023 1.0099 1.0008 1.0061 1.0171 0.9894 1.0052 1.0046 0.9975 0.9886 0.9896 0.9892
dispcorr: -0.029678273 hartree
energy: -1117.880108748622
dipole: -15.67862 16.08770 0.40908 -10.60247 9.26944 -1.33302 6.25830 -6.33813 -0.07983
magnitude: 1.39666 au
magnitude: 3.55003 debye
