program: Orca
programVersion: 5.0.2
elementType: O O O C C C C C C C C C C C C C C C C C C C C C C C H H H H H H H H H H H H H H H H H H H H H H H H H H
charge: 0
multiplicity: 1
keywords: wb97x-d3
keywords: def2-TZVPP
keywords: def2/J RIJCOSX
keywords: DEFGRID2
keywords: scfconv7
keywords: smallprint printgap noloewdin
keywords: NOSOSCF
formula: C23H26O3
InChI: InChI=1/C23H26O3/c1-16(2)13-20-21(23(20,3)4)22(24)25-15-17-9-8-12-19(14-17)26-18-10-6-5-7-11-18/h5-14,20-21H,15H2,1-4H3
52 atoms
O  -1.908462 1.953535 -0.745621
O  -3.018856 0.159354 -1.483353
O  2.994696 0.635902 0.627946
C  -4.954487 0.606333 0.902474
C  -3.807259 -0.150238 1.472586
C  -3.551285 1.121472 0.648789
C  -5.757102 1.452311 1.864116
C  -5.80056 0.027994 -0.205214
C  -3.404046 -1.48958 0.977519
C  -2.840635 1.00007 -0.63151
C  -2.167115 -1.986972 1.05231
C  -1.844267 -3.356933 0.541846
C  -1.006306 -1.231613 1.619675
C  -0.986497 1.865699 -1.842044
C  0.08823 0.859346 -1.543292
C  1.084803 1.187205 -0.62843
C  0.094792 -0.39565 -2.141341
C  2.069836 0.264839 -0.314334
C  1.084562 -1.31367 -1.815901
C  2.073644 -0.996554 -0.898461
C  4.307979 0.267331 0.468906
C  4.998946 -0.125219 1.60606
C  4.947062 0.336204 -0.762906
C  6.344267 -0.452543 1.507573
C  6.288876 -0.005322 -0.848265
C  6.992989 -0.401242 0.281554
H  -3.622592 0.018142 2.52994
H  -3.263412 1.990242 1.229512
H  -5.133402 1.875888 2.651948
H  -6.533696 0.852191 2.341963
H  -6.247113 2.277865 1.345034
H  -5.27931 -0.675524 -0.846419
H  -6.198383 0.823678 -0.837165
H  -6.651782 -0.496987 0.230608
H  -4.181023 -2.107692 0.537282
H  -1.065181 -3.308728 -0.223981
H  -2.713547 -3.850717 0.109167
H  -1.453697 -3.994488 1.33849
H  -1.26271 -0.228379 1.955124
H  -0.20707 -1.144719 0.878834
H  -0.575767 -1.769696 2.468403
H  -0.565614 2.865132 -1.927927
H  -1.503976 1.63697 -2.77334
H  1.101041 2.166419 -0.163621
H  -0.666714 -0.657493 -2.863846
H  1.084732 -2.292484 -2.277059
H  2.833578 -1.724837 -0.645469
H  4.488131 -0.171229 2.55938
H  4.412468 0.655274 -1.648771
H  6.882011 -0.758481 2.39512
H  6.786807 0.045746 -1.807408
H  8.039357 -0.665121 0.206315
elementType: O C H
totalener: -1117.85279598 hartree
nucrepener: 2278.32485543 hartree
electener: -3396.17765142 hartree
oneelecener: -6046.97871098 hartree
twoeener: 2650.80105956 hartree
cpcmener: -0.02996086 hartree
kineticenergy: 1112.81376091 hartree
xcener: -110.231069632364 hartree
chargesum: -0.0000000
charge: -0.295700 -0.492639 -0.344522 0.139284 -0.014889 -0.109160 -0.266755 -0.299728 -0.284552 0.400948 -0.016598 -0.222905 -0.227153 0.090335 0.009915 -0.281323 -0.172907 0.275662 -0.178763 -0.150783 0.275396 -0.248964 -0.182102 -0.128359 -0.152413 -0.185932 0.113539 0.094680 0.088085 0.095006 0.094980 0.091748 0.102960 0.098631 0.125139 0.092570 0.090612 0.098354 0.096880 0.037707 0.115264 0.124776 0.115408 0.133040 0.142261 0.161945 0.158821 0.148036 0.159067 0.161782 0.161965 0.161348
qa: -0.2957 -0.4926 -0.3445 0.1393 -0.0149 -0.1092 -0.2668 -0.2997 -0.2846 0.4009 -0.0166 -0.2229 -0.2272 0.0903 0.0099 -0.2813 -0.1729 0.2757 -0.1788 -0.1508 0.2754 -0.2490 -0.1821 -0.1284 -0.1524 -0.1859 0.1135 0.0947 0.0881 0.0950 0.0950 0.0917 0.1030 0.0986 0.1251 0.0926 0.0906 0.0984 0.0969 0.0377 0.1153 0.1248 0.1154 0.1330 0.1423 0.1619 0.1588 0.1480 0.1591 0.1618 0.1620 0.1613
va: 2.1068 1.9924 2.0461 3.7407 3.8074 3.8321 3.9005 3.8915 3.8490 4.1087 3.6919 3.9252 3.9343 3.7987 3.6134 4.0573 3.8662 3.6857 3.8951 3.8433 3.6873 4.0045 3.8947 3.8826 3.8876 3.8943 1.0055 1.0308 1.0041 1.0021 1.0025 1.0165 0.9999 0.9988 0.9999 0.9957 1.0072 0.9962 1.0078 1.0239 1.0036 0.9958 1.0110 1.0212 1.0149 0.9916 0.9948 1.0077 0.9964 0.9879 0.9897 0.9893
dispcorr: -0.027553064 hartree
energy: -1117.880349048458
dipole: -20.09429 20.78341 0.68912 -8.08080 8.23009 0.14929 6.53261 -6.17533 0.35728
magnitude: 0.79045 au
magnitude: 2.00918 debye
