program: Orca
programVersion: 5.0.2
elementType: O O O C C C C C C C C C C C C C C C C C C C C C C C H H H H H H H H H H H H H H H H H H H H H H H H H H
charge: 0
multiplicity: 1
keywords: wb97x-d3
keywords: def2-TZVPP
keywords: def2/J RIJCOSX
keywords: DEFGRID2
keywords: scfconv7
keywords: smallprint printgap noloewdin
keywords: NOSOSCF
formula: C23H26O3
InChI: InChI=1/C23H26O3/c1-16(2)13-20-21(23(20,3)4)22(24)25-15-17-9-8-12-19(14-17)26-18-10-6-5-7-11-18/h5-14,20-21H,15H2,1-4H3
52 atoms
O  -1.375052 -1.733073 -0.185957
O  -2.58764 -1.101935 1.58378
O  3.142787 1.121563 -0.69178
C  -4.896934 -0.563659 -0.419382
C  -4.045435 0.655814 -0.487367
C  -3.406242 -0.732605 -0.63975
C  -5.737102 -0.882176 -1.634716
C  -5.565735 -0.975449 0.868819
C  -3.77526 1.511482 0.694714
C  -2.459429 -1.195548 0.383953
C  -2.67522 2.250349 0.862326
C  -2.483823 3.10327 2.078053
C  -1.540274 2.268858 -0.113612
C  -0.27638 -2.1086 0.65965
C  0.585025 -0.916397 0.965788
C  1.478214 -0.462537 0.001674
C  0.483581 -0.237361 2.176968
C  2.263435 0.652105 0.256441
C  1.260722 0.88747 2.412419
C  2.158992 1.338484 1.455351
C  4.103133 0.266281 -1.171694
C  4.664612 -0.736391 -0.389841
C  4.533668 0.46959 -2.476246
C  5.660306 -1.539125 -0.928657
C  5.535616 -0.336248 -2.997437
C  6.099914 -1.347533 -2.231397
H  -4.07279 1.185948 -1.435655
H  -3.116215 -0.989227 -1.651644
H  -6.705841 -0.383088 -1.570719
H  -5.921017 -1.955291 -1.712706
H  -5.256385 -0.557768 -2.558416
H  -6.556395 -0.51993 0.919912
H  -5.027898 -0.684484 1.765873
H  -5.704139 -2.057538 0.898991
H  -4.539907 1.544582 1.465263
H  -3.323712 3.032133 2.768978
H  -2.356852 4.154063 1.805644
H  -1.576904 2.812793 2.61588
H  -1.264756 3.294419 -0.368401
H  -1.759109 1.740401 -1.039006
H  -0.649218 1.813405 0.327599
H  0.278515 -2.844274 0.07978
H  -0.629724 -2.592709 1.570081
H  1.568058 -0.98664 -0.943305
H  -0.198701 -0.587882 2.939818
H  1.177946 1.413557 3.354212
H  2.776777 2.207845 1.640029
H  4.341806 -0.89465 0.631152
H  4.089188 1.253132 -3.0767
H  6.095981 -2.318267 -0.317013
H  5.868542 -0.175604 -4.014457
H  6.876066 -1.977687 -2.644248
elementType: O C H
totalener: -1117.85249535 hartree
nucrepener: 2279.28705525 hartree
electener: -3397.13955061 hartree
oneelecener: -6048.75785926 hartree
twoeener: 2651.61830866 hartree
cpcmener: -0.02977602 hartree
kineticenergy: 1112.80116801 hartree
xcener: -110.227610985033 hartree
chargesum: 0.0000000
charge: -0.294468 -0.495979 -0.348125 0.135763 -0.012124 -0.117120 -0.265496 -0.299469 -0.288987 0.412788 -0.017175 -0.220765 -0.214567 0.082213 -0.001348 -0.180483 -0.171505 0.221115 -0.154430 -0.199195 0.267518 -0.167328 -0.240715 -0.167970 -0.132354 -0.186911 0.113099 0.093965 0.093947 0.096167 0.088294 0.099279 0.092321 0.101688 0.125780 0.090890 0.097555 0.089857 0.110925 0.098334 0.033040 0.124334 0.116468 0.146558 0.143688 0.160175 0.149771 0.156145 0.148845 0.163077 0.161045 0.161871
qa: -0.2945 -0.4960 -0.3481 0.1358 -0.0121 -0.1171 -0.2655 -0.2995 -0.2890 0.4128 -0.0172 -0.2208 -0.2146 0.0822 -0.0013 -0.1805 -0.1715 0.2211 -0.1544 -0.1992 0.2675 -0.1673 -0.2407 -0.1680 -0.1324 -0.1869 0.1131 0.0940 0.0939 0.0962 0.0883 0.0993 0.0923 0.1017 0.1258 0.0909 0.0976 0.0899 0.1109 0.0983 0.0330 0.1243 0.1165 0.1466 0.1437 0.1602 0.1498 0.1561 0.1488 0.1631 0.1610 0.1619
va: 2.1083 1.9892 2.0449 3.7398 3.8060 3.8385 3.9000 3.8908 3.8514 4.0989 3.6946 3.9271 3.9373 3.8062 3.5940 3.9477 3.8483 3.7362 3.8818 3.9662 3.6949 3.8589 3.9911 3.9048 3.8943 3.8914 1.0060 1.0314 1.0023 1.0023 1.0040 0.9984 1.0165 1.0004 0.9995 1.0072 0.9971 0.9964 1.0042 1.0082 1.0242 0.9964 1.0115 1.0062 1.0160 0.9905 1.0028 0.9984 1.0074 0.9895 0.9880 0.9890
dispcorr: -0.027376977 hartree
energy: -1117.879872331503
dipole: -22.94991 23.28820 0.33830 5.01501 -5.37638 -0.36137 1.04648 -1.74652 -0.70004
magnitude: 0.85737 au
magnitude: 2.17927 debye
