program: Orca
programVersion: 5.0.2
elementType: O O O C C C C C C C C C C C C C C C C C C C C C C C H H H H H H H H H H H H H H H H H H H H H H H H H H
charge: 0
multiplicity: 1
keywords: wb97x-d3
keywords: def2-TZVPP
keywords: def2/J RIJCOSX
keywords: DEFGRID2
keywords: scfconv7
keywords: smallprint printgap noloewdin
keywords: NOSOSCF
formula: C23H26O3
InChI: InChI=1/C23H26O3/c1-16(2)13-20-21(23(20,3)4)22(24)25-15-17-9-8-12-19(14-17)26-18-10-6-5-7-11-18/h5-14,20-21H,15H2,1-4H3
52 atoms
O  -1.677687 1.7646 -0.614071
O  -1.015035 0.721002 1.250667
O  2.997043 0.426626 -2.034859
C  -2.021862 -1.813943 -0.337066
C  -3.115419 -1.427956 0.594496
C  -2.493021 -0.365701 -0.305794
C  -2.399107 -2.572149 -1.587325
C  -0.657959 -2.185767 0.187393
C  -2.958678 -1.445581 2.070872
C  -1.658124 0.718717 0.226154
C  -3.626578 -0.660617 2.919485
C  -3.4637 -0.796966 4.401925
C  -4.568633 0.414953 2.476405
C  -0.900899 2.90945 -0.293629
C  0.555842 2.772007 -0.650317
C  1.102716 1.604988 -1.162545
C  1.371567 3.890714 -0.480727
C  2.454906 1.564126 -1.483712
C  2.71192 3.839514 -0.820618
C  3.270015 2.668718 -1.319522
C  2.91634 -0.749014 -1.332122
C  2.977961 -0.793079 0.055669
C  2.823869 -1.919297 -2.074197
C  2.957321 -2.025508 0.694832
C  2.808939 -3.143024 -1.420684
C  2.874775 -3.203516 -0.034943
H  -4.114017 -1.687965 0.251796
H  -3.097866 -0.069195 -1.154321
H  -2.426126 -3.645282 -1.388588
H  -1.67223 -2.400444 -2.38339
H  -3.380558 -2.277887 -1.960339
H  -0.61575 -3.262389 0.362227
H  -0.391932 -1.694851 1.11965
H  0.109755 -1.944623 -0.550487
H  -2.282517 -2.190092 2.48152
H  -4.420288 -1.020309 4.881147
H  -3.108493 0.136945 4.845093
H  -2.761081 -1.586215 4.668085
H  -5.556962 0.273444 2.921139
H  -4.691479 0.461515 1.395817
H  -4.217019 1.393231 2.815608
H  -1.008934 3.173449 0.761287
H  -1.342094 3.721139 -0.87274
H  0.499644 0.723335 -1.342236
H  0.949685 4.808351 -0.088747
H  3.334592 4.714664 -0.691074
H  4.31895 2.619293 -1.581198
H  3.053853 0.115494 0.639471
H  2.772801 -1.870747 -3.154606
H  3.0103 -2.05927 1.775245
H  2.739607 -4.053022 -2.002133
H  2.860716 -4.159213 0.471696
elementType: O C H
totalener: -1117.85357131 hartree
nucrepener: 2340.06982029 hartree
electener: -3457.92339160 hartree
oneelecener: -6170.64359564 hartree
twoeener: 2712.72020404 hartree
cpcmener: -0.03255382 hartree
kineticenergy: 1112.79200743 hartree
xcener: -110.229747115705 hartree
chargesum: -0.0000000
charge: -0.301606 -0.484206 -0.345053 0.169484 -0.012498 -0.093654 -0.267947 -0.309492 -0.293148 0.376293 -0.020525 -0.225851 -0.266817 0.084626 0.012030 -0.174277 -0.222590 0.221858 -0.130661 -0.220557 0.263965 -0.169728 -0.218640 -0.170505 -0.133040 -0.185915 0.117892 0.097343 0.094712 0.095721 0.090057 0.110734 0.100870 0.062681 0.126702 0.096046 0.094490 0.089813 0.106465 0.093238 0.098767 0.119568 0.132676 0.154448 0.146040 0.161133 0.149433 0.153872 0.146106 0.160952 0.159545 0.159152
qa: -0.3016 -0.4842 -0.3451 0.1695 -0.0125 -0.0937 -0.2679 -0.3095 -0.2931 0.3763 -0.0205 -0.2259 -0.2668 0.0846 0.0120 -0.1743 -0.2226 0.2219 -0.1307 -0.2206 0.2640 -0.1697 -0.2186 -0.1705 -0.1330 -0.1859 0.1179 0.0973 0.0947 0.0957 0.0901 0.1107 0.1009 0.0627 0.1267 0.0960 0.0945 0.0898 0.1065 0.0932 0.0988 0.1196 0.1327 0.1544 0.1460 0.1611 0.1494 0.1539 0.1461 0.1610 0.1595 0.1592
va: 2.1091 1.9888 2.0505 3.7356 3.8502 3.8347 3.8993 3.8920 3.8504 4.0790 3.7016 3.9245 3.9443 3.8252 3.6539 3.9325 3.9617 3.7696 3.8779 3.9945 3.6805 3.8342 3.9576 3.8553 3.8718 3.8514 1.0022 1.0304 1.0019 1.0013 1.0050 1.0000 1.0107 1.0142 1.0000 0.9964 0.9966 1.0069 0.9992 1.0060 0.9979 1.0107 0.9920 0.9963 0.9988 0.9879 1.0038 1.0003 1.0079 0.9912 0.9885 0.9908
dispcorr: -0.028189715 hartree
energy: -1117.881761025006
dipole: -19.74618 18.73354 -1.01265 -11.15295 11.31517 0.16222 11.87337 -12.09419 -0.22082
magnitude: 1.04906 au
magnitude: 2.66650 debye
