program: Orca
programVersion: 5.0.2
elementType: O O O C C C C C C C C C C C C C C C C C C C C C C C H H H H H H H H H H H H H H H H H H H H H H H H H H
charge: 0
multiplicity: 1
keywords: wb97x-d3
keywords: def2-TZVPP
keywords: def2/J RIJCOSX
keywords: DEFGRID2
keywords: scfconv7
keywords: smallprint printgap noloewdin
keywords: NOSOSCF
formula: C23H26O3
InChI: InChI=1/C23H26O3/c1-16(2)13-20-21(23(20,3)4)22(24)25-15-17-9-8-12-19(14-17)26-18-10-6-5-7-11-18/h5-14,20-21H,15H2,1-4H3
52 atoms
O  -1.60176 0.781572 -1.017453
O  -3.57147 1.20581 -1.968491
O  3.472008 0.620829 -0.027261
C  -2.775587 -1.992282 -0.383995
C  -2.844061 -1.148286 0.841118
C  -3.416107 -0.614092 -0.474241
C  -3.746636 -3.143499 -0.497709
C  -1.447517 -2.285151 -1.037847
C  -1.629512 -0.612163 1.501584
C  -2.882386 0.534181 -1.22679
C  -1.601252 0.495375 2.245215
C  -0.346968 0.952734 2.922423
C  -2.819912 1.354757 2.432946
C  -0.993805 1.930295 -1.624028
C  0.254657 2.201926 -0.839151
C  1.280248 1.25985 -0.830835
C  0.376919 3.365718 -0.091578
C  2.407384 1.481045 -0.054159
C  1.522019 3.587253 0.663025
C  2.534392 2.643595 0.697634
C  3.29669 -0.733971 -0.155426
C  4.267892 -1.423222 -0.867393
C  2.2471 -1.411828 0.452066
C  4.189229 -2.805125 -0.966971
C  2.172554 -2.792196 0.331036
C  3.139888 -3.495006 -0.375243
H  -3.644546 -1.406401 1.53135
H  -4.497801 -0.638286 -0.536515
H  -4.6984 -2.919938 -0.014622
H  -3.335135 -4.036967 -0.024164
H  -3.949552 -3.384631 -1.542717
H  -0.69655 -1.512618 -0.896253
H  -1.573736 -2.435581 -2.111671
H  -1.03895 -3.210352 -0.626358
H  -0.717606 -1.192862 1.395782
H  -0.056663 1.946956 2.571902
H  0.48841 0.274773 2.74769
H  -0.490336 1.038835 4.002964
H  -3.594948 0.836445 3.002705
H  -3.270045 1.63816 1.479021
H  -2.584565 2.273063 2.970562
H  -1.664417 2.789151 -1.585851
H  -0.774959 1.712606 -2.67179
H  1.191911 0.363952 -1.434214
H  -0.421947 4.096423 -0.094423
H  1.619271 4.493913 1.245081
H  3.42179 2.806438 1.295902
H  5.082907 -0.882784 -1.331705
H  1.496902 -0.878835 1.021917
H  4.950836 -3.340875 -1.518008
H  1.35288 -3.31845 0.803058
H  3.078346 -4.57159 -0.460179
elementType: O C H
totalener: -1117.84888376 hartree
nucrepener: 2386.19661112 hartree
electener: -3504.04549487 hartree
oneelecener: -6261.38175346 hartree
twoeener: 2757.33625858 hartree
cpcmener: -0.03239823 hartree
kineticenergy: 1112.80771411 hartree
xcener: -110.231145263181 hartree
chargesum: 0.0000000
charge: -0.254911 -0.516020 -0.338715 0.138632 -0.017948 -0.159507 -0.270935 -0.275213 -0.219603 0.441791 -0.046035 -0.273031 -0.269660 0.067842 -0.015930 -0.233672 -0.206085 0.316080 -0.118674 -0.252778 0.287043 -0.236558 -0.161336 -0.139785 -0.194503 -0.164396 0.115513 0.093896 0.088295 0.093573 0.096443 0.055370 0.107657 0.100440 0.139015 0.094181 0.099973 0.118943 0.108378 0.094658 0.099068 0.102349 0.128547 0.151632 0.145426 0.159775 0.146488 0.147433 0.141040 0.161143 0.163524 0.161147
qa: -0.2549 -0.5160 -0.3387 0.1386 -0.0179 -0.1595 -0.2709 -0.2752 -0.2196 0.4418 -0.0460 -0.2730 -0.2697 0.0678 -0.0159 -0.2337 -0.2061 0.3161 -0.1187 -0.2528 0.2870 -0.2366 -0.1613 -0.1398 -0.1945 -0.1644 0.1155 0.0939 0.0883 0.0936 0.0964 0.0554 0.1077 0.1004 0.1390 0.0942 0.1000 0.1189 0.1084 0.0947 0.0991 0.1023 0.1285 0.1516 0.1454 0.1598 0.1465 0.1474 0.1410 0.1611 0.1635 0.1611
va: 2.1125 1.9811 2.0794 3.7340 3.7782 3.9000 3.9067 3.9222 3.7331 4.0763 3.6597 3.9294 3.9440 3.8265 3.7158 3.8916 3.8870 3.6563 3.8631 3.9900 3.6956 3.9817 3.8364 3.8972 3.8951 3.8859 1.0045 1.0304 1.0055 1.0017 1.0016 1.0032 1.0050 0.9976 0.9763 0.9902 0.9939 0.9988 0.9969 1.0004 1.0045 1.0131 0.9938 1.0018 1.0009 0.9886 1.0073 1.0078 0.9912 0.9877 0.9893 0.9892
dispcorr: -0.031374871 hartree
energy: -1117.880258629147
dipole: -13.22914 13.74075 0.51161 -8.86140 8.12280 -0.73860 9.08923 -8.19575 0.89347
magnitude: 1.26711 au
magnitude: 3.22074 debye
