program: Orca
programVersion: 5.0.2
elementType: O O O C C C C C C C C C C C C C C C C C C C C C C C H H H H H H H H H H H H H H H H H H H H H H H H H H
charge: 0
multiplicity: 1
keywords: wb97x-d3
keywords: def2-TZVPP
keywords: def2/J RIJCOSX
keywords: DEFGRID2
keywords: scfconv7
keywords: smallprint printgap noloewdin
keywords: NOSOSCF
formula: C23H26O3
InChI: InChI=1/C23H26O3/c1-16(2)13-20-21(23(20,3)4)22(24)25-15-17-9-8-12-19(14-17)26-18-10-6-5-7-11-18/h5-14,20-21H,15H2,1-4H3
52 atoms
O  -1.451366 1.422705 -0.73816
O  -1.201281 0.70241 1.364184
O  3.459971 0.750746 -1.635443
C  -1.630951 -2.150029 0.186037
C  -3.018563 -1.655263 0.390081
C  -2.006444 -0.779549 -0.351877
C  -1.406957 -3.194556 -0.881813
C  -0.700155 -2.307684 1.361842
C  -3.546173 -1.307082 1.732865
C  -1.513729 0.48167 0.217201
C  -4.442858 -0.348854 1.978454
C  -4.963762 -0.104859 3.361267
C  -4.987785 0.559102 0.919351
C  -0.901725 2.6886 -0.402419
C  0.60343 2.691602 -0.415917
C  1.333156 1.655626 -0.981954
C  1.2717 3.802894 0.09387
C  2.719773 1.739184 -1.032287
C  2.653052 3.877392 0.024972
C  3.391176 2.842545 -0.534484
C  3.196744 -0.5554 -1.294449
C  3.039649 -1.475491 -2.319662
C  3.141439 -0.953244 0.035486
C  2.833467 -2.813051 -2.007617
C  2.935353 -2.292443 0.332501
C  2.7785 -3.226565 -0.683952
H  -3.759852 -2.062585 -0.293118
H  -2.154626 -0.736211 -1.424206
H  -0.385682 -3.146049 -1.265801
H  -2.087831 -3.066654 -1.72409
H  -1.562398 -4.196123 -0.476325
H  0.335761 -2.159813 1.053779
H  -0.782666 -3.325544 1.74806
H  -0.903021 -1.629901 2.185958
H  -3.197148 -1.911589 2.565294
H  -4.770086 0.923274 3.677461
H  -4.513196 -0.774357 4.093623
H  -6.047516 -0.240436 3.400484
H  -6.080383 0.538899 0.919415
H  -4.648904 0.303629 -0.082849
H  -4.699875 1.59505 1.117499
H  -1.279786 3.044649 0.557931
H  -1.275429 3.370591 -1.167191
H  0.838994 0.788941 -1.403579
H  0.707577 4.613567 0.538822
H  3.166011 4.744131 0.420298
H  4.471058 2.893811 -0.584075
H  3.081468 -1.149757 -3.351147
H  3.268278 -0.231159 0.832672
H  2.709403 -3.531887 -2.806839
H  2.900054 -2.605874 1.367644
H  2.615884 -4.268787 -0.444191
elementType: O C H
totalener: -1117.85249939 hartree
nucrepener: 2334.79846170 hartree
electener: -3452.65096109 hartree
oneelecener: -6159.90062573 hartree
twoeener: 2707.24966464 hartree
cpcmener: -0.03202794 hartree
kineticenergy: 1112.80454209 hartree
xcener: -110.230839468902 hartree
chargesum: -0.0000000
charge: -0.308244 -0.489668 -0.350779 0.160099 -0.011111 -0.090075 -0.271697 -0.294105 -0.307221 0.388588 -0.010661 -0.225597 -0.267367 0.092003 0.009484 -0.149889 -0.233870 0.203712 -0.125601 -0.228679 0.247148 -0.236253 -0.164240 -0.113362 -0.137281 -0.214016 0.115893 0.098092 0.087800 0.091813 0.096188 0.078844 0.104024 0.098316 0.125315 0.095052 0.090320 0.096445 0.107351 0.094301 0.100305 0.115778 0.130453 0.148168 0.145519 0.160814 0.149575 0.149332 0.159321 0.161439 0.167469 0.160756
qa: -0.3082 -0.4897 -0.3508 0.1601 -0.0111 -0.0901 -0.2717 -0.2941 -0.3072 0.3886 -0.0107 -0.2256 -0.2674 0.0920 0.0095 -0.1499 -0.2339 0.2037 -0.1256 -0.2287 0.2471 -0.2363 -0.1642 -0.1134 -0.1373 -0.2140 0.1159 0.0981 0.0878 0.0918 0.0962 0.0788 0.1040 0.0983 0.1253 0.0951 0.0903 0.0964 0.1074 0.0943 0.1003 0.1158 0.1305 0.1482 0.1455 0.1608 0.1496 0.1493 0.1593 0.1614 0.1675 0.1608
va: 2.0934 1.9883 2.0371 3.6951 3.8501 3.8052 3.9067 3.8738 3.8637 4.0492 3.6966 3.9247 3.9482 3.8076 3.6495 3.8742 3.9707 3.7777 3.8896 3.9971 3.7045 3.9992 3.8648 3.8329 3.8173 3.8561 1.0040 1.0307 1.0059 1.0057 1.0018 1.0275 1.0000 1.0197 1.0015 0.9967 1.0067 0.9964 0.9991 1.0059 0.9980 1.0148 0.9903 1.0139 1.0001 0.9875 1.0046 1.0056 0.9970 0.9871 0.9866 0.9912
dispcorr: -0.027916958 hartree
energy: -1117.880416349641
dipole: -22.41671 21.48010 -0.93662 -11.40517 11.16213 -0.24304 9.54575 -10.08293 -0.53718
magnitude: 1.10674 au
magnitude: 2.81312 debye
