program: Orca
programVersion: 5.0.2
elementType: O O O C C C C C C C C C C C C C C C C C C C C C C C H H H H H H H H H H H H H H H H H H H H H H H H H H
charge: 0
multiplicity: 1
keywords: wb97x-d3
keywords: def2-TZVPP
keywords: def2/J RIJCOSX
keywords: DEFGRID2
keywords: scfconv7
keywords: smallprint printgap noloewdin
keywords: NOSOSCF
formula: C23H26O3
InChI: InChI=1/C23H26O3/c1-16(2)13-20-21(23(20,3)4)22(24)25-15-17-9-8-12-19(14-17)26-18-10-6-5-7-11-18/h5-14,20-21H,15H2,1-4H3
52 atoms
O  -2.194556 1.371743 -0.427351
O  -1.700506 1.633202 1.728827
O  2.774849 0.573548 -0.918956
C  -3.688648 -1.171665 0.267417
C  -2.268145 -1.628473 0.173827
C  -2.63336 -0.421607 1.056524
C  -4.610853 -2.011597 1.121558
C  -4.407756 -0.568314 -0.915105
C  -1.453096 -1.514821 -1.049727
C  -2.137592 0.945485 0.8299
C  -0.365899 -2.242503 -1.336067
C  0.365633 -2.037237 -2.628345
C  0.23267 -3.293091 -0.451899
C  -1.662089 2.661764 -0.721654
C  -0.165581 2.720411 -0.591542
C  0.617983 1.595307 -0.816021
C  0.447943 3.928378 -0.275201
C  1.994228 1.683885 -0.686513
C  1.828878 4.008242 -0.177518
C  2.614896 2.880267 -0.368127
C  2.84657 -0.410795 0.029073
C  2.132791 -0.396647 1.222081
C  3.710068 -1.463213 -0.262195
C  2.300687 -1.443517 2.122115
C  3.865338 -2.496352 0.64738
C  3.163516 -2.493205 1.847187
H  -2.039829 -2.494561 0.784305
H  -2.623397 -0.64695 2.116507
H  -4.092184 -2.447708 1.976029
H  -5.032946 -2.829704 0.535066
H  -5.440392 -1.413491 1.503833
H  -3.76627 -0.073149 -1.637139
H  -5.153034 0.155694 -0.581466
H  -4.939465 -1.359827 -1.446449
H  -1.772249 -0.795492 -1.795077
H  0.434843 -2.970231 -3.193763
H  1.393844 -1.713071 -2.444855
H  -0.114773 -1.292696 -3.262601
H  -0.227862 -3.365307 0.530935
H  1.298549 -3.103756 -0.306288
H  0.160366 -4.275737 -0.926292
H  -2.134089 3.426215 -0.101265
H  -1.9595 2.849047 -1.753565
H  0.172508 0.641081 -1.073467
H  -0.157208 4.809205 -0.099037
H  2.297909 4.951802 0.068136
H  3.6919 2.930349 -0.273802
H  1.450149 0.407068 1.466095
H  4.258858 -1.464277 -1.195621
H  1.744601 -1.428066 3.050487
H  4.540736 -3.309018 0.413774
H  3.286404 -3.301054 2.555914
elementType: O C H
totalener: -1117.85201438 hartree
nucrepener: 2400.94852389 hartree
electener: -3518.80053827 hartree
oneelecener: -6291.80365266 hartree
twoeener: 2773.00311439 hartree
cpcmener: -0.03093242 hartree
kineticenergy: 1112.79877222 hartree
xcener: -110.234687200560 hartree
chargesum: -0.0000000
charge: -0.282744 -0.500739 -0.340929 0.118250 0.023201 -0.106506 -0.268878 -0.275320 -0.289152 0.418740 -0.034004 -0.233035 -0.271658 0.067979 -0.019864 -0.142786 -0.176919 0.185119 -0.150682 -0.168096 0.321216 -0.205135 -0.260742 -0.172818 -0.098826 -0.198554 0.115995 0.095084 0.087954 0.095490 0.095407 0.093384 0.102630 0.095513 0.124204 0.108356 0.087001 0.094491 0.096647 0.063846 0.115297 0.122888 0.119234 0.124933 0.145427 0.161452 0.149967 0.148845 0.143605 0.159489 0.157415 0.158328
qa: -0.2827 -0.5007 -0.3409 0.1182 0.0232 -0.1065 -0.2689 -0.2753 -0.2892 0.4187 -0.0340 -0.2330 -0.2717 0.0680 -0.0199 -0.1428 -0.1769 0.1851 -0.1507 -0.1681 0.3212 -0.2051 -0.2607 -0.1728 -0.0988 -0.1986 0.1160 0.0951 0.0880 0.0955 0.0954 0.0934 0.1026 0.0955 0.1242 0.1084 0.0870 0.0945 0.0966 0.0638 0.1153 0.1229 0.1192 0.1249 0.1454 0.1615 0.1500 0.1488 0.1436 0.1595 0.1574 0.1583
va: 2.1122 1.9874 2.0458 3.7404 3.7158 3.8270 3.9027 3.8952 3.8400 4.1064 3.6949 3.9068 3.9436 3.7983 3.6705 3.8451 3.9202 3.7606 3.9048 3.9820 3.6042 3.8400 3.9444 3.8817 3.8329 3.8812 1.0024 1.0274 1.0059 1.0017 1.0017 1.0109 1.0004 1.0002 1.0119 0.9975 0.9996 1.0076 1.0095 1.0052 1.0027 1.0073 0.9953 1.0193 0.9994 0.9878 1.0013 1.0110 1.0117 0.9914 0.9889 0.9907
dispcorr: -0.030956162 hartree
energy: -1117.882970539594
dipole: -13.82929 13.08856 -0.74072 -17.00552 16.43438 -0.57114 -4.03190 3.28783 -0.74407
magnitude: 1.19520 au
magnitude: 3.03796 debye
