program: Orca
programVersion: 5.0.2
elementType: O O O C C C C C C C C C C C C C C C C C C C C C C C H H H H H H H H H H H H H H H H H H H H H H H H H H
charge: 0
multiplicity: 1
keywords: wb97x-d3
keywords: def2-TZVPP
keywords: def2/J RIJCOSX
keywords: DEFGRID2
keywords: scfconv7
keywords: smallprint printgap noloewdin
keywords: NOSOSCF
formula: C23H26O3
InChI: InChI=1/C23H26O3/c1-16(2)13-20-21(23(20,3)4)22(24)25-15-17-9-8-12-19(14-17)26-18-10-6-5-7-11-18/h5-14,20-21H,15H2,1-4H3
52 atoms
O  -1.957584 1.235762 -1.790889
O  -1.351762 -0.845469 -1.242341
O  2.944338 0.610595 0.921106
C  -4.222398 -1.198845 -0.121191
C  -3.455359 -0.526942 0.961535
C  -3.435442 0.049582 -0.466004
C  -5.721606 -1.005017 -0.118629
C  -3.819348 -2.560128 -0.63191
C  -2.241616 -1.114397 1.574589
C  -2.158171 0.055713 -1.19191
C  -1.303012 -0.387427 2.186674
C  -0.099457 -1.019716 2.810477
C  -1.387492 1.11151 2.260322
C  -0.658089 1.500801 -2.342871
C  0.290044 1.930654 -1.258699
C  1.203539 1.031303 -0.716767
C  0.218691 3.228701 -0.761921
C  2.049085 1.442761 0.306304
C  1.058721 3.623532 0.268547
C  1.978262 2.736797 0.805441
C  3.458818 -0.485079 0.274491
C  3.965168 -0.407462 -1.016938
C  3.522601 -1.670454 0.992661
C  4.528536 -1.537564 -1.590856
C  4.102969 -2.789014 0.411234
C  4.601519 -2.730261 -0.882631
H  -4.040343 0.098104 1.632205
H  -4.02505 0.947655 -0.606119
H  -6.200119 -1.749391 0.520718
H  -6.132216 -1.117275 -1.12375
H  -6.005088 -0.018817 0.250558
H  -2.753816 -2.761313 -0.579378
H  -4.130052 -2.683836 -1.67077
H  -4.327167 -3.329023 -0.046709
H  -2.125398 -2.192933 1.531887
H  -0.045277 -0.793301 3.87846
H  0.817644 -0.623924 2.366753
H  -0.093593 -2.102971 2.69171
H  -1.360378 1.566902 1.266963
H  -0.563556 1.534024 2.834594
H  -2.317302 1.443049 2.728065
H  -0.819678 2.310579 -3.05216
H  -0.280548 0.639502 -2.89386
H  1.250327 0.020195 -1.09917
H  -0.487463 3.931641 -1.186279
H  1.008591 4.633846 0.652454
H  2.641183 3.043725 1.60444
H  3.923643 0.52101 -1.572118
H  3.128236 -1.712973 2.000306
H  4.917904 -1.480465 -2.598772
H  4.159587 -3.710791 0.975166
H  5.046788 -3.605965 -1.335417
elementType: O C H
totalener: -1117.85164126 hartree
nucrepener: 2355.10595865 hartree
electener: -3472.95759990 hartree
oneelecener: -6200.88730639 hartree
twoeener: 2727.92970648 hartree
cpcmener: -0.02991261 hartree
kineticenergy: 1112.80210352 hartree
xcener: -110.228894981430 hartree
chargesum: -0.0000000
charge: -0.296421 -0.492674 -0.339007 0.129813 -0.020893 -0.106202 -0.265414 -0.297863 -0.270386 0.402592 -0.010346 -0.201250 -0.295339 0.077006 -0.016128 -0.163173 -0.230171 0.301950 -0.103325 -0.282603 0.292651 -0.207806 -0.250032 -0.143431 -0.127540 -0.186441 0.114539 0.092951 0.095174 0.096081 0.087989 0.091974 0.101847 0.099775 0.126518 0.105264 0.067122 0.090455 0.080989 0.105268 0.116194 0.126429 0.116148 0.137475 0.142488 0.159884 0.145738 0.158909 0.158829 0.162814 0.160900 0.160679
qa: -0.2964 -0.4927 -0.3390 0.1298 -0.0209 -0.1062 -0.2654 -0.2979 -0.2704 0.4026 -0.0103 -0.2012 -0.2953 0.0770 -0.0161 -0.1632 -0.2302 0.3019 -0.1033 -0.2826 0.2927 -0.2078 -0.2500 -0.1434 -0.1275 -0.1864 0.1145 0.0930 0.0952 0.0961 0.0880 0.0920 0.1018 0.0998 0.1265 0.1053 0.0671 0.0905 0.0810 0.1053 0.1162 0.1264 0.1161 0.1375 0.1425 0.1599 0.1457 0.1589 0.1588 0.1628 0.1609 0.1607
va: 2.1035 1.9881 2.0408 3.7674 3.8036 3.8362 3.8976 3.8884 3.7954 4.0980 3.6519 3.9107 3.9670 3.8115 3.6257 3.8110 3.9368 3.6407 3.8674 4.0040 3.6811 3.9251 3.9855 3.8811 3.8938 3.9055 1.0056 1.0326 1.0020 1.0022 1.0045 1.0181 1.0001 0.9985 0.9997 0.9972 0.9999 1.0082 0.9986 1.0021 1.0035 0.9939 1.0122 1.0294 1.0040 0.9872 1.0086 0.9963 0.9985 0.9888 0.9895 0.9896
dispcorr: -0.029238593 hartree
energy: -1117.880879848279
dipole: -17.99958 17.48467 -0.51492 -6.74048 7.50839 0.76790 7.08032 -7.25564 -0.17532
magnitude: 0.94104 au
magnitude: 2.39192 debye
