program: Orca
programVersion: 5.0.2
elementType: O O O C C C C C C C C C C C C C C C C C C C C C C C H H H H H H H H H H H H H H H H H H H H H H H H H H
charge: 0
multiplicity: 1
keywords: wb97x-d3
keywords: def2-TZVPP
keywords: def2/J RIJCOSX
keywords: DEFGRID2
keywords: scfconv7
keywords: smallprint printgap noloewdin
keywords: NOSOSCF
formula: C23H26O3
InChI: InChI=1/C23H26O3/c1-16(2)13-20-21(23(20,3)4)22(24)25-15-17-9-8-12-19(14-17)26-18-10-6-5-7-11-18/h5-14,20-21H,15H2,1-4H3
52 atoms
O  -1.828772 1.190566 -0.072539
O  -3.537448 1.889737 1.170947
O  2.957578 0.140593 -1.480622
C  -3.471937 -1.140125 -1.03267
C  -2.952857 -1.582719 0.290267
C  -3.689064 -0.240623 0.170608
C  -4.732968 -1.809363 -1.531372
C  -2.534423 -0.781507 -2.160837
C  -1.507433 -1.665028 0.60877
C  -3.027057 1.039981 0.467989
C  -1.02767 -1.623978 1.854137
C  0.434119 -1.766024 2.136793
C  -1.926561 -1.432156 3.043521
C  -1.077239 2.365506 0.251218
C  0.166806 2.351039 -0.586442
C  0.997845 1.233736 -0.594474
C  0.496223 3.46087 -1.354986
C  2.144848 1.239912 -1.374603
C  1.651931 3.45728 -2.124083
C  2.483174 2.34974 -2.13795
C  3.276743 -0.592161 -0.365216
C  3.361965 -1.968967 -0.519002
C  3.570084 0.006016 0.853871
C  3.751277 -2.752866 0.557466
C  3.947389 -0.7921 1.924036
C  4.039894 -2.170598 1.783796
H  -3.562904 -2.321621 0.805252
H  -4.697649 -0.247856 0.566829
H  -5.411049 -2.065299 -0.71669
H  -4.489739 -2.731401 -2.06281
H  -5.271725 -1.159731 -2.223499
H  -2.388996 -1.660739 -2.791583
H  -1.550231 -0.449494 -1.844629
H  -2.965936 -0.000069 -2.788001
H  -0.814522 -1.80039 -0.216358
H  0.82202 -0.877366 2.640687
H  1.014443 -1.924856 1.22834
H  0.62316 -2.606389 2.810106
H  -1.354099 -1.283492 3.958557
H  -2.571627 -2.299621 3.203493
H  -2.58498 -0.569854 2.922945
H  -0.831601 2.35443 1.315787
H  -1.659835 3.26459 0.046743
H  0.745712 0.362417 -0.000615
H  -0.153071 4.326987 -1.357412
H  1.906974 4.323312 -2.720056
H  3.382771 2.338617 -2.739805
H  3.130834 -2.420216 -1.475516
H  3.513312 1.080767 0.972297
H  3.818676 -3.825887 0.435097
H  4.176142 -0.32677 2.873592
H  4.336448 -2.784622 2.623045
elementType: O C H
totalener: -1117.85018624 hartree
nucrepener: 2353.66297492 hartree
electener: -3471.51316116 hartree
oneelecener: -6196.53880055 hartree
twoeener: 2725.02563939 hartree
cpcmener: -0.03022391 hartree
kineticenergy: 1112.81069449 hartree
xcener: -110.232052953818 hartree
chargesum: -0.0000000
charge: -0.263879 -0.516197 -0.341763 0.136536 -0.028878 -0.125983 -0.270448 -0.276723 -0.253261 0.427688 -0.037263 -0.210390 -0.275050 0.073052 -0.020349 -0.180760 -0.194759 0.265181 -0.124598 -0.242137 0.278985 -0.234366 -0.176606 -0.123041 -0.167163 -0.182847 0.113169 0.092418 0.088112 0.094550 0.096841 0.097879 0.076469 0.104908 0.129836 0.102765 0.056189 0.118618 0.097473 0.104923 0.096217 0.126036 0.106995 0.124467 0.145726 0.161215 0.148561 0.146004 0.155351 0.159274 0.161376 0.159648
qa: -0.2639 -0.5162 -0.3418 0.1365 -0.0289 -0.1260 -0.2704 -0.2767 -0.2533 0.4277 -0.0373 -0.2104 -0.2751 0.0731 -0.0203 -0.1808 -0.1948 0.2652 -0.1246 -0.2421 0.2790 -0.2344 -0.1766 -0.1230 -0.1672 -0.1828 0.1132 0.0924 0.0881 0.0946 0.0968 0.0979 0.0765 0.1049 0.1298 0.1028 0.0562 0.1186 0.0975 0.1049 0.0962 0.1260 0.1070 0.1245 0.1457 0.1612 0.1486 0.1460 0.1554 0.1593 0.1614 0.1596
va: 2.1212 1.9763 2.0621 3.7544 3.8067 3.8656 3.9033 3.9063 3.7554 4.0876 3.7165 3.9042 3.9450 3.8031 3.7653 3.8806 3.9211 3.7149 3.8975 3.9919 3.6667 3.9543 3.8718 3.8528 3.8546 3.8566 1.0039 1.0301 1.0053 1.0021 1.0013 1.0003 1.0054 1.0012 0.9931 0.9913 1.0185 0.9955 1.0059 0.9961 1.0050 0.9928 1.0114 1.0033 1.0001 0.9880 1.0059 1.0084 0.9982 0.9891 0.9911 0.9907
dispcorr: -0.029754970 hartree
energy: -1117.879941207435
dipole: -12.15427 12.85326 0.69900 -12.73558 11.98086 -0.75472 5.02975 -5.04479 -0.01504
magnitude: 1.02880 au
magnitude: 2.61500 debye
