program: Orca
programVersion: 5.0.2
elementType: O O O C C C C C C C C C C C C C C C C C C C C C C C H H H H H H H H H H H H H H H H H H H H H H H H H H
charge: 0
multiplicity: 1
keywords: wb97x-d3
keywords: def2-TZVPP
keywords: def2/J RIJCOSX
keywords: DEFGRID2
keywords: scfconv7
keywords: smallprint printgap noloewdin
keywords: NOSOSCF
formula: C23H26O3
InChI: InChI=1/C23H26O3/c1-16(2)13-20-21(23(20,3)4)22(24)25-15-17-9-8-12-19(14-17)26-18-10-6-5-7-11-18/h5-14,20-21H,15H2,1-4H3
52 atoms
O  -2.401317 1.906443 -1.534868
O  -1.976378 -0.259003 -1.871409
O  3.169775 0.159837 -1.367453
C  -4.471569 -0.893752 -0.158312
C  -3.65061 -0.174226 0.872739
C  -3.855428 0.426545 -0.529953
C  -5.970199 -0.839088 0.035427
C  -4.020457 -2.208211 -0.749045
C  -2.314614 -0.622608 1.306636
C  -2.668127 0.604621 -1.383877
C  -1.744377 -0.384097 2.493754
C  -0.362465 -0.887626 2.786829
C  -2.369834 0.382896 3.617745
C  -1.139848 2.251999 -2.11536
C  -0.003145 1.905294 -1.193942
C  1.068046 1.157479 -1.660448
C  -0.022484 2.325661 0.134072
C  2.126084 0.85201 -0.81331
C  1.033486 2.00605 0.972158
C  2.118236 1.273229 0.509025
C  3.924263 -0.679892 -0.582764
C  5.303476 -0.567897 -0.665806
C  3.334128 -1.648883 0.21952
C  6.102364 -1.440351 0.061385
C  4.144256 -2.506611 0.94877
C  5.52813 -2.407873 0.873656
H  -4.22833 0.347749 1.626432
H  -4.527551 1.277219 -0.547884
H  -6.489366 -0.96341 -0.916895
H  -6.291257 0.109532 0.467453
H  -6.301361 -1.637542 0.701741
H  -4.388404 -2.317835 -1.77048
H  -4.445506 -3.024033 -0.16151
H  -2.944792 -2.352438 -0.768651
H  -1.729639 -1.19121 0.592065
H  -0.37482 -1.609822 3.607494
H  0.290853 -0.071922 3.106868
H  0.096896 -1.367151 1.922064
H  -3.403724 0.669212 3.4405
H  -1.803231 1.2956 3.817258
H  -2.342089 -0.201322 4.540081
H  -1.196337 3.329368 -2.267326
H  -1.014608 1.784188 -3.093224
H  1.085444 0.809389 -2.686482
H  -0.853536 2.905494 0.514978
H  1.023261 2.337468 2.002202
H  2.939489 1.044993 1.175734
H  5.747596 0.191361 -1.29687
H  2.255944 -1.737062 0.277067
H  7.17903 -1.355824 -0.005793
H  3.687502 -3.261843 1.574766
H  6.153355 -3.083311 1.442104
elementType: O C H
totalener: -1117.85233825 hartree
nucrepener: 2298.84116212 hartree
electener: -3416.69350037 hartree
oneelecener: -6088.06041089 hartree
twoeener: 2671.36691052 hartree
cpcmener: -0.03195064 hartree
kineticenergy: 1112.80260468 hartree
xcener: -110.229665864619 hartree
chargesum: 0.0000000
charge: -0.291326 -0.481285 -0.341516 0.119519 0.038374 -0.099158 -0.268215 -0.280924 -0.306320 0.389813 -0.063905 -0.228690 -0.254388 0.095703 0.053693 -0.258368 -0.275555 0.299235 -0.155392 -0.198373 0.262057 -0.228552 -0.181623 -0.136686 -0.165216 -0.172946 0.117477 0.101558 0.094345 0.088102 0.096053 0.102229 0.093727 0.090804 0.124798 0.113416 0.088488 0.085254 0.090584 0.097693 0.097891 0.126360 0.116040 0.133827 0.142859 0.166616 0.157057 0.148665 0.171765 0.161178 0.161953 0.161305
qa: -0.2913 -0.4813 -0.3415 0.1195 0.0384 -0.0992 -0.2682 -0.2809 -0.3063 0.3898 -0.0639 -0.2287 -0.2544 0.0957 0.0537 -0.2584 -0.2756 0.2992 -0.1554 -0.1984 0.2621 -0.2286 -0.1816 -0.1367 -0.1652 -0.1729 0.1175 0.1016 0.0943 0.0881 0.0961 0.1022 0.0937 0.0908 0.1248 0.1134 0.0885 0.0853 0.0906 0.0977 0.0979 0.1264 0.1160 0.1338 0.1429 0.1666 0.1571 0.1487 0.1718 0.1612 0.1620 0.1613
va: 2.1058 2.0166 2.0603 3.7252 3.7306 3.8157 3.9053 3.8888 3.8283 4.1520 3.7682 3.9181 3.9388 3.7893 3.5983 4.0651 3.9144 3.6975 3.8411 3.8706 3.6949 3.9965 3.9035 3.8828 3.9050 3.8893 1.0000 1.0281 1.0022 1.0044 1.0020 0.9998 1.0014 1.0131 1.0125 0.9983 0.9945 1.0102 1.0135 0.9970 0.9971 0.9933 1.0094 1.0203 1.0131 0.9865 0.9979 1.0061 0.9867 0.9883 0.9904 0.9890
dispcorr: -0.027313120 hartree
energy: -1117.879651372051
dipole: -19.40540 18.96414 -0.44126 -7.25795 7.90239 0.64445 16.09406 -14.61772 1.47635
magnitude: 1.67021 au
magnitude: 4.24535 debye
