program: Orca
programVersion: 5.0.2
elementType: O O O C C C C C C C C C C C C C C C C C C C C C C C H H H H H H H H H H H H H H H H H H H H H H H H H H
charge: 0
multiplicity: 1
keywords: wb97x-d3
keywords: def2-TZVPP
keywords: def2/J RIJCOSX
keywords: DEFGRID2
keywords: scfconv7
keywords: smallprint printgap noloewdin
keywords: NOSOSCF
formula: C23H26O3
InChI: InChI=1/C23H26O3/c1-16(2)13-20-21(23(20,3)4)22(24)25-15-17-9-8-12-19(14-17)26-18-10-6-5-7-11-18/h5-14,20-21H,15H2,1-4H3
52 atoms
O  -2.415993 1.712024 -1.327327
O  -2.306393 -0.511663 -1.523918
O  2.533881 -0.742771 -0.626263
C  -4.862912 -0.605368 0.23992
C  -3.730846 -0.486408 1.199114
C  -3.84209 0.493464 0.020467
C  -6.210538 -0.108084 0.709937
C  -4.977047 -1.783371 -0.695643
C  -2.634555 -1.483332 1.281995
C  -2.800822 0.468718 -1.015558
C  -1.39662 -1.213628 1.705206
C  -0.348203 -2.280019 1.788261
C  -0.94748 0.153222 2.11827
C  -1.257526 1.870631 -2.161095
C  -0.007758 1.739463 -1.337803
C  0.749826 0.576394 -1.373266
C  0.377386 2.784771 -0.501172
C  1.878981 0.457024 -0.571743
C  1.507607 2.656949 0.289375
C  2.265566 1.493394 0.267048
C  3.859897 -0.80345 -0.264621
C  4.216111 -1.633942 0.785494
C  4.819261 -0.091743 -0.972726
C  5.557148 -1.761092 1.124728
C  6.153877 -0.220773 -0.618376
C  6.527517 -1.054655 0.428623
H  -3.973843 -0.002463 2.141275
H  -4.170574 1.490933 0.287011
H  -6.829077 0.203587 -0.133621
H  -6.117086 0.74131 1.387524
H  -6.744971 -0.898637 1.240035
H  -4.027228 -2.233638 -0.967835
H  -5.484738 -1.491914 -1.616562
H  -5.581948 -2.559594 -0.223094
H  -2.870642 -2.503868 0.99525
H  -0.732104 -3.258211 1.499484
H  0.053974 -2.359546 2.801464
H  0.499502 -2.043261 1.139081
H  -0.025661 0.428784 1.600706
H  -0.713323 0.173713 3.186181
H  -1.686576 0.928335 1.925215
H  -1.345556 2.876272 -2.568719
H  -1.271717 1.166762 -2.993377
H  0.468892 -0.242935 -2.023338
H  -0.202509 3.698868 -0.474506
H  1.807969 3.468757 0.938596
H  3.138272 1.407629 0.901158
H  3.453848 -2.179187 1.327882
H  4.528993 0.551506 -1.794204
H  5.839697 -2.411103 1.942248
H  6.905325 0.329829 -1.168762
H  7.570538 -1.154644 0.697556
elementType: O C H
totalener: -1117.85276800 hartree
nucrepener: 2309.05426924 hartree
electener: -3426.90703724 hartree
oneelecener: -6108.71430459 hartree
twoeener: 2681.80726735 hartree
cpcmener: -0.03040697 hartree
kineticenergy: 1112.81015499 hartree
xcener: -110.229767671015 hartree
chargesum: -0.0000000
charge: -0.296036 -0.492952 -0.339593 0.136834 -0.013358 -0.111969 -0.266665 -0.299303 -0.281113 0.404418 -0.016928 -0.209379 -0.255234 0.084096 0.014411 -0.242717 -0.221409 0.269054 -0.151651 -0.166991 0.220916 -0.206106 -0.161700 -0.146645 -0.161145 -0.164561 0.115248 0.094555 0.095874 0.088138 0.094467 0.091096 0.103188 0.098591 0.123923 0.092500 0.097634 0.078443 0.056039 0.118268 0.097479 0.125931 0.114582 0.128598 0.144345 0.161138 0.153627 0.155937 0.159701 0.162121 0.162019 0.162285
qa: -0.2960 -0.4930 -0.3396 0.1368 -0.0134 -0.1120 -0.2667 -0.2993 -0.2811 0.4044 -0.0169 -0.2094 -0.2552 0.0841 0.0144 -0.2427 -0.2214 0.2691 -0.1517 -0.1670 0.2209 -0.2061 -0.1617 -0.1466 -0.1611 -0.1646 0.1152 0.0946 0.0959 0.0881 0.0945 0.0911 0.1032 0.0986 0.1239 0.0925 0.0976 0.0784 0.0560 0.1183 0.0975 0.1259 0.1146 0.1286 0.1443 0.1611 0.1536 0.1559 0.1597 0.1621 0.1620 0.1623
va: 2.1073 1.9912 2.0285 3.7450 3.8050 3.8296 3.8997 3.8902 3.8496 4.1076 3.6892 3.9170 3.9442 3.8031 3.6241 3.9813 3.9427 3.6632 3.9059 3.8529 3.7579 3.9567 3.9274 3.8942 3.8983 3.8806 1.0042 1.0312 1.0022 1.0040 1.0022 1.0167 0.9996 0.9990 1.0013 1.0092 0.9966 1.0056 1.0136 1.0025 1.0062 0.9945 1.0124 1.0332 1.0044 0.9901 1.0009 0.9974 0.9957 0.9897 0.9893 0.9885
dispcorr: -0.028434296 hartree
energy: -1117.881202297605
dipole: -16.88923 17.28867 0.39945 -4.90391 6.16258 1.25866 10.49851 -9.60208 0.89642
magnitude: 1.59605 au
magnitude: 4.05683 debye
