program: Orca
programVersion: 5.0.2
elementType: O O O C C C C C C C C C C C C C C C C C C C C C C C H H H H H H H H H H H H H H H H H H H H H H H H H H
charge: 0
multiplicity: 1
keywords: wb97x-d3
keywords: def2-TZVPP
keywords: def2/J RIJCOSX
keywords: DEFGRID2
keywords: scfconv7
keywords: smallprint printgap noloewdin
keywords: NOSOSCF
formula: C23H26O3
InChI: InChI=1/C23H26O3/c1-16(2)13-20-21(23(20,3)4)22(24)25-15-17-9-8-12-19(14-17)26-18-10-6-5-7-11-18/h5-14,20-21H,15H2,1-4H3
52 atoms
O  -1.936839 1.781886 -1.108474
O  -1.524949 1.258936 1.02288
O  2.624362 -0.088556 -2.0046
C  -2.177598 -1.623686 -0.121435
C  -3.352493 -1.175177 0.675168
C  -2.774525 -0.24353 -0.379098
C  -2.416491 -2.633638 -1.21774
C  -0.817834 -1.758995 0.518521
C  -3.277152 -0.910324 2.134697
C  -2.026759 0.975152 -0.04061
C  -4.044313 -0.03785 2.791113
C  -3.929063 0.144621 4.272955
C  -5.034162 0.854485 2.108389
C  -1.079234 2.91486 -0.994632
C  0.367221 2.52298 -0.858843
C  0.854298 1.376478 -1.479416
C  1.231501 3.315984 -0.114932
C  2.189552 1.036456 -1.3455
C  2.572784 2.97382 -0.005299
C  3.064497 1.831513 -0.61644
C  3.311941 -1.049818 -1.309848
C  4.218662 -1.812605 -2.034143
C  3.093265 -1.301535 0.039542
C  4.910272 -2.83442 -1.401104
C  3.80087 -2.321771 0.660531
C  4.709927 -3.091724 -0.051498
H  -4.302088 -1.593993 0.350306
H  -3.342919 -0.161827 -1.298166
H  -1.667251 -2.54049 -2.006135
H  -3.399584 -2.513959 -1.67404
H  -2.355614 -3.648906 -0.820693
H  -0.701453 -2.766972 0.920783
H  -0.639181 -1.06261 1.333402
H  -0.031701 -1.613109 -0.224996
H  -2.562523 -1.500836 2.701222
H  -3.676507 1.178972 4.519857
H  -3.167194 -0.50149 4.70869
H  -4.878823 -0.067632 4.770021
H  -5.98639 0.861844 2.642072
H  -5.230451 0.568312 1.077123
H  -4.676234 1.887265 2.102964
H  -1.384613 3.557152 -0.165985
H  -1.236873 3.473733 -1.917529
H  0.204653 0.734586 -2.06235
H  0.856573 4.200045 0.385764
H  3.242344 3.598732 0.570752
H  4.109492 1.564189 -0.523577
H  4.377894 -1.606249 -3.084893
H  2.378086 -0.719761 0.607078
H  5.616816 -3.426365 -1.967863
H  3.629879 -2.516725 1.711101
H  5.257063 -3.884465 0.440468
elementType: O C H
totalener: -1117.85225331 hartree
nucrepener: 2303.45757279 hartree
electener: -3421.30982609 hartree
oneelecener: -6097.34783174 hartree
twoeener: 2676.03800564 hartree
cpcmener: -0.03203718 hartree
kineticenergy: 1112.81009906 hartree
xcener: -110.231215178551 hartree
chargesum: -0.0000000
charge: -0.302141 -0.484210 -0.344061 0.154345 -0.017395 -0.098263 -0.265920 -0.310879 -0.279862 0.387651 -0.028394 -0.225884 -0.267142 0.102160 0.040015 -0.287773 -0.216581 0.262290 -0.129927 -0.184576 0.319094 -0.253139 -0.211620 -0.129295 -0.168135 -0.187295 0.116000 0.096358 0.096099 0.089119 0.094889 0.109314 0.099690 0.089681 0.126400 0.094269 0.089589 0.096414 0.104360 0.095406 0.099995 0.117181 0.122789 0.134954 0.145666 0.161433 0.160652 0.147657 0.155754 0.160502 0.161699 0.161068
qa: -0.3021 -0.4842 -0.3441 0.1543 -0.0174 -0.0983 -0.2659 -0.3109 -0.2799 0.3877 -0.0284 -0.2259 -0.2671 0.1022 0.0400 -0.2878 -0.2166 0.2623 -0.1299 -0.1846 0.3191 -0.2531 -0.2116 -0.1293 -0.1681 -0.1873 0.1160 0.0964 0.0961 0.0891 0.0949 0.1093 0.0997 0.0897 0.1264 0.0943 0.0896 0.0964 0.1044 0.0954 0.1000 0.1172 0.1228 0.1350 0.1457 0.1614 0.1607 0.1477 0.1558 0.1605 0.1617 0.1611
va: 2.1036 1.9914 2.0419 3.7349 3.8537 3.8311 3.8988 3.9016 3.8458 4.0839 3.7052 3.9266 3.9455 3.7967 3.6071 4.0225 3.9708 3.7238 3.8864 3.9339 3.6271 4.0008 3.8654 3.8897 3.9179 3.8967 1.0030 1.0311 1.0024 1.0045 1.0018 1.0012 1.0111 1.0021 0.9986 0.9956 1.0068 0.9969 1.0007 1.0039 0.9981 1.0089 0.9932 1.0270 1.0016 0.9890 0.9942 1.0081 0.9970 0.9881 0.9903 0.9891
dispcorr: -0.026860406 hartree
energy: -1117.879113711625
dipole: -18.90330 18.55722 -0.34608 -8.24156 8.17327 -0.06829 12.63578 -12.90103 -0.26526
magnitude: 0.44136 au
magnitude: 1.12185 debye
