program: Gaussian 09
title: 000071742
version: EM64L-G09RevD.01
frameworkgroup: C1[X(C22H17ClN2)]
method: RPBEPBE
basis: SDD
operation: Freq
keyword: #p
keyword: freq=noraman
keyword: PBEPBE/SDD
title: #p freq=noraman PBEPBE/SDD
converged: YES YES NO NO
title: Mulliken charges:
elementType: Cl N N C C C C C C C C C C C C C C C C C C C C C C H H H H H H H H H H H H H H H H H
charge: -0.043634 -0.150710 -0.094522 -0.327232 0.428790 0.574894 -0.394311 -0.394654 0.348026 -0.359560 -0.356595 -0.408628 -0.409742 -0.167829 -0.202642 0.341314 -0.239534 -0.247598 -0.350263 -0.228699 -0.395705 -0.396668 -0.235715 -0.236032 -0.240489 0.245878 0.237594 0.264641 0.267998 0.241452 0.242169 0.278949 0.258142 0.259300 0.236800 0.252049 0.238956 0.240693 0.237610 0.227694 0.226624 0.231189
chargesum: 0.00000
title: Mulliken charges with hydrogens summed into heavy atoms:
elementType: Cl N N C C C C C C C C C C C C C C C C C C C C C C
charge: -0.043634 -0.150710 -0.094522 -0.081354 0.428790 0.574894 -0.156717 -0.130013 0.348026 -0.359560 -0.088597 -0.167176 -0.167573 0.111120 0.055499 0.341314 0.019766 -0.010798 -0.098214 0.010258 -0.155012 -0.159058 -0.008020 -0.009408 -0.009300
polarizability: 3.59508546e+02 1.96616857e+00 2.49158703e+02 -1.16207055e+01 -2.72586717e+00 1.75603282e+02
1716.lowfreq: -0.0007 -0.0004 0.0003 1.5447 3.9139 7.2229 20.7647 27.5829 29.7285
frequency: 20.5310 27.1997 29.7117 48.3918 53.7358 63.9931 75.1404 96.3353 107.0484 141.7676 151.5029 197.7037 232.9474 246.5210 277.3898 293.1817 325.0373 358.7946 389.8583 404.1190 407.4147 411.9441 426.0010 451.5753 491.2771 520.4209 555.6002 595.6039 614.3156 628.4777 632.9374 639.0386 655.2194 679.0682 702.6752 712.7879 722.9634 737.0434 744.1670 759.0864 769.8487 779.4113 809.1876 815.3263 843.8716 850.9732 852.0473 864.1529 866.3677 879.3196 883.8985 921.9166 958.6438 965.1031 974.6343 980.2360 989.1556 993.0730 995.1967 996.0803 1005.5320 1016.6507 1019.0977 1039.0811 1041.3839 1053.8804 1086.0981 1106.6208 1122.8810 1130.6032 1172.7021 1174.1561 1182.4301 1191.9753 1203.8290 1208.9790 1216.0037 1236.9273 1257.4720 1267.7888 1290.3495 1291.3522 1307.3742 1318.5143 1330.6418 1353.7612 1373.5750 1377.9284 1384.4323 1413.2902 1426.5334 1438.7084 1449.3231 1460.2971 1469.1024 1477.4027 1517.4735 1569.2279 1576.4399 1589.7668 1602.3834 1613.5307 1623.2973 2999.7160 3116.6530 3123.5851 3127.7452 3133.6261 3136.3165 3140.8963 3146.3092 3147.2634 3149.9146 3155.8817 3162.9609 3165.8550 3176.9888 3226.4399 3232.5713 3258.4521
redmass: 4.1624 8.6821 5.7621 5.7464 4.6445 5.1102 3.7235 5.3830 4.9963 7.6847 6.1142 5.2679 6.1699 5.2770 5.4609 6.0082 4.6570 5.6363 5.9352 2.8734 4.3988 4.0649 4.5480 3.5130 3.6282 4.0160 2.8701 5.1109 6.5048 5.5565 5.4381 4.7514 3.4380 5.5480 1.7650 4.5369 4.2805 1.2862 3.3701 1.3620 1.8814 1.4084 2.9597 3.1525 1.4129 1.2765 1.3325 1.9333 2.6269 5.7930 1.8281 1.4447 1.3891 1.3755 1.4422 1.4386 4.3432 1.3476 1.3180 6.4936 3.9938 6.2240 2.8937 2.1284 1.8997 1.6649 1.6159 1.7485 1.7638 1.4197 1.1331 1.0530 2.0454 1.1134 1.4760 1.6714 1.5156 2.4974 1.8726 1.9750 1.8525 2.0400 1.4619 1.3929 3.9068 3.3503 4.6051 6.7832 2.2081 3.5616 2.1856 2.4041 2.6547 2.4777 4.1971 2.1696 2.8070 5.9740 6.1466 6.5400 6.9792 6.0366 6.2197 1.0825 1.0880 1.0846 1.0874 1.0874 1.0863 1.0920 1.0949 1.0904 1.0961 1.0962 1.0952 1.1016 1.0995 1.0921 1.0974 1.1079
irintensity: 0.0590 0.1241 0.6429 1.5451 0.1475 0.1119 0.1836 1.2728 0.1213 0.8273 0.6853 0.2994 0.1015 3.4926 1.7930 0.6130 0.2130 0.1735 2.4545 0.0484 2.7453 2.0988 2.9170 10.1374 15.3841 0.4771 4.4221 1.5713 0.0473 9.7633 2.2292 0.6978 16.2808 20.5068 44.0366 7.7911 12.1186 24.1527 14.6156 107.8521 51.8306 62.3920 5.8118 15.5267 0.4559 0.5859 1.4598 5.2966 33.7570 12.8845 3.8210 1.4463 0.8143 0.9441 0.5778 0.8256 0.4021 0.3167 0.1010 15.8587 24.4163 40.3269 6.6096 8.4087 6.8099 37.5067 7.9533 11.3972 6.8475 6.0015 2.5041 0.0239 2.0382 0.2731 6.9428 36.4162 4.6567 15.6134 31.2860 17.9840 0.2692 0.8344 4.8246 2.2380 3.3613 4.0472 2.5704 1.8939 21.8699 9.4351 24.5987 1.6082 34.3027 36.5441 5.2072 50.1043 10.5634 3.4728 17.6149 1.0144 2.7336 5.6890 1.0884 5.8806 17.3365 6.2560 1.3418 8.7052 0.4624 14.0965 7.3442 5.9592 43.9642 3.2597 10.4511 27.8147 13.0282 4.8152 0.5255 2.1203
temp: 298.150 k
press: 1.00000 atm
elementType: 17 7 7 6 6 6 6 6 6 6 6 6 6 6 6 6 6 6 6 6 6 6 6 6 6 1 1 1 1 1 1 1 1 1 1 1 1 1 1 1 1 1
symmnumber: 1
zpe: 856567.7 jmol-1
zpe.correction: 0.326249 hartree
zpe.thermalcorrener: 0.346680 hartree
zpe.thermalcorrenthalpy: 0.347624 hartree
zpe.thermalcorrgfe: 0.273891 hartree
zpe.sumelectzpe: -1416.389134 hartree
zpe.sumelectthermal: -1416.368703 hartree
zpe.sumelectthermalent: -1416.367759 hartree
zpe.sumelectthermalfe: -1416.441492 hartree
dipole: -2.2718 -5.3436 1.3317
dipole: 5.9573
quadrupole: -143.6000 -158.5557 -147.9297
quadrupole: -17.6515 4.4197 0.2646
quadrupole: 6.4285 -8.5272 2.0987 -17.6515 4.4197 0.2646
hfenergy: -1416.7153829 hartree
pointgroup: C01 [X(C22H17Cl1N2)]
dipole: -0.8808483 2.1247514 -0.4503054 debye
polarizability: 358.1293076|-2.3143158|249.2248524|19.6623325|1.1583468|176.9163713 unknown
charge 0 multiplicity 1
42 atoms
Cl 4.547054 0.314444 2.054558
N  2.370084 -1.55971 0.088086
N  2.914347 -3.756757 -0.082941
C  1.796351 -0.319277 0.667777
C  0.276874 -0.228392 0.469573
C  2.554486 0.911536 0.153045
C  -0.461735 0.694539 1.252518
C  -0.421261 -1.037209 -0.456778
C  -2.56891 0.005135 0.175762
C  3.810164 1.286905 0.689833
C  2.040546 1.7089 -0.901685
C  -1.857123 0.8101 1.109225
C  -1.819985 -0.91924 -0.600798
C  2.883494 -1.745096 -1.205015
C  2.407056 -2.80176 0.720762
C  -4.047943 0.122568 0.024391
C  4.53809 2.395372 0.218465
C  2.751366 2.823021 -1.396233
C  3.214819 -3.099362 -1.289167
C  4.002329 3.168079 -0.836418
C  -4.841837 -1.012801 -0.298717
C  -4.704717 1.372355 0.19844
C  -6.240939 -0.902831 -0.444413
C  -6.104013 1.483775 0.054403
C  -6.8802 0.346467 -0.26854
H  1.99183 -0.38807 1.756463
H  0.059451 1.322907 1.985666
H  0.124872 -1.763956 -1.067659
H  1.064165 1.448032 -1.323949
H  -2.406467 1.506957 1.751989
H  -2.331983 -1.538447 -1.345816
H  2.988221 -0.925473 -1.909635
H  2.064344 -2.950083 1.742294
H  5.503152 2.647665 0.666913
H  2.330225 3.419536 -2.211974
H  3.653343 -3.635593 -2.127526
H  4.560917 4.032496 -1.210357
H  -4.364509 -1.993498 -0.405022
H  -4.11291 2.268434 0.417776
H  -6.833271 -1.79284 -0.684634
H  -6.58755 2.458475 0.184576
H  -7.966628 0.432196 -0.380638
