program: Orca
programVersion: 5.0.2
elementType: O O O C C C C C C C C C C C C C C C C C C C C C C C H H H H H H H H H H H H H H H H H H H H H H H H H H
charge: 0
multiplicity: 1
keywords: wb97x-d3
keywords: def2-TZVPP
keywords: def2/J RIJCOSX
keywords: DEFGRID2
keywords: scfconv7
keywords: smallprint printgap noloewdin
keywords: NOSOSCF
formula: C23H26O3
InChI: InChI=1/C23H26O3/c1-16(2)13-20-21(23(20,3)4)22(24)25-15-17-9-8-12-19(14-17)26-18-10-6-5-7-11-18/h5-14,20-21H,15H2,1-4H3
52 atoms
O  -1.525758 2.083131 0.925972
O  -2.153354 1.232765 -1.037427
O  3.326822 0.980602 -0.297401
C  -3.53193 -1.006923 0.632603
C  -2.117128 -1.490304 0.563021
C  -2.413343 -0.048486 0.986044
C  -4.359379 -1.469579 1.80828
C  -4.341441 -0.856346 -0.631159
C  -1.444295 -1.823693 -0.709655
C  -2.040826 1.11333 0.161495
C  -0.915155 -3.013294 -1.017323
C  -0.228764 -3.225355 -2.332789
C  -0.94222 -4.220792 -0.131177
C  -1.010573 3.238334 0.259932
C  0.219136 2.923789 -0.545643
C  1.198455 2.091744 -0.01367
C  0.388183 3.470588 -1.811255
C  2.322107 1.784387 -0.76753
C  1.535354 3.186956 -2.53933
C  2.500945 2.332885 -2.031241
C  3.047076 -0.050855 0.565457
C  1.955507 -0.892543 0.385724
C  3.94065 -0.261745 1.606089
C  1.757617 -1.940418 1.272559
C  3.739053 -1.325818 2.474808
C  2.644062 -2.164068 2.317825
H  -1.807076 -2.093709 1.409475
H  -2.285733 0.12985 2.047115
H  -3.757618 -1.580297 2.710817
H  -4.819984 -2.435878 1.594525
H  -5.160366 -0.760234 2.024746
H  -3.749926 -0.648925 -1.517628
H  -5.083482 -0.062719 -0.527679
H  -4.882966 -1.785945 -0.815507
H  -1.379032 -1.044544 -1.459742
H  0.820944 -3.491692 -2.183313
H  -0.26375 -2.338796 -2.965007
H  -0.680928 -4.053587 -2.884247
H  -1.524887 -5.018773 -0.598947
H  -1.371298 -4.037925 0.851797
H  0.0648 -4.620624 0.009561
H  -0.776869 3.934497 1.064827
H  -1.776841 3.700378 -0.365172
H  1.078666 1.681469 0.98147
H  -0.37777 4.111348 -2.229795
H  1.668992 3.614474 -3.524294
H  3.385387 2.091498 -2.606921
H  1.26198 -0.740847 -0.432512
H  4.788597 0.399778 1.731244
H  0.902038 -2.588677 1.137536
H  4.439173 -1.490558 3.283283
H  2.481635 -2.985891 3.002107
elementType: O C H
totalener: -1117.85334919 hartree
nucrepener: 2360.47662168 hartree
electener: -3478.32997087 hartree
oneelecener: -6210.96550747 hartree
twoeener: 2732.63553660 hartree
cpcmener: -0.02935130 hartree
kineticenergy: 1112.80256479 hartree
xcener: -110.232778488854 hartree
chargesum: 0.0000000
charge: -0.300833 -0.491770 -0.340895 0.149220 0.004672 -0.099179 -0.266131 -0.291733 -0.349384 0.404562 -0.010740 -0.236446 -0.270491 0.104705 0.036815 -0.257504 -0.240448 0.306387 -0.106188 -0.272430 0.310114 -0.244484 -0.270912 -0.067903 -0.098171 -0.252578 0.114925 0.099205 0.088906 0.094507 0.095368 0.095815 0.105451 0.096501 0.131001 0.093422 0.091227 0.101441 0.113219 0.095858 0.095219 0.123475 0.116661 0.141037 0.145558 0.161007 0.148462 0.165332 0.147359 0.173051 0.161075 0.156663
qa: -0.3008 -0.4918 -0.3409 0.1492 0.0047 -0.0992 -0.2661 -0.2917 -0.3494 0.4046 -0.0107 -0.2364 -0.2705 0.1047 0.0368 -0.2575 -0.2404 0.3064 -0.1062 -0.2724 0.3101 -0.2445 -0.2709 -0.0679 -0.0982 -0.2526 0.1149 0.0992 0.0889 0.0945 0.0954 0.0958 0.1055 0.0965 0.1310 0.0934 0.0912 0.1014 0.1132 0.0959 0.0952 0.1235 0.1167 0.1410 0.1456 0.1610 0.1485 0.1653 0.1474 0.1731 0.1611 0.1567
va: 2.1101 1.9944 2.0753 3.7583 3.7166 3.9300 3.9042 3.9033 3.7907 4.0645 3.6987 3.9171 3.9259 3.7963 3.6124 3.9211 3.9703 3.6918 3.8817 4.0140 3.7230 3.9285 4.0221 3.7700 3.8555 3.9999 1.0025 1.0285 1.0049 1.0022 1.0021 1.0133 1.0000 1.0015 1.0190 0.9960 1.0076 0.9975 0.9978 1.0088 0.9956 0.9935 1.0087 1.0176 1.0025 0.9875 1.0064 0.9915 1.0075 0.9705 0.9870 0.9953
dispcorr: -0.028381783 hartree
energy: -1117.881730975414
dipole: -17.52787 17.07775 -0.45013 -20.86871 20.28766 -0.58105 -0.19887 1.37541 1.17654
magnitude: 1.38725 au
magnitude: 3.52612 debye
