program: Orca
programVersion: 5.0.2
elementType: O O O C C C C C C C C C C C C C C C C C C C C C C C H H H H H H H H H H H H H H H H H H H H H H H H H H
charge: 0
multiplicity: 1
keywords: wb97x-d3
keywords: def2-TZVPP
keywords: def2/J RIJCOSX
keywords: DEFGRID2
keywords: scfconv7
keywords: smallprint printgap noloewdin
keywords: NOSOSCF
formula: C23H26O3
InChI: InChI=1/C23H26O3/c1-16(2)13-20-21(23(20,3)4)22(24)25-15-17-9-8-12-19(14-17)26-18-10-6-5-7-11-18/h5-14,20-21H,15H2,1-4H3
52 atoms
O  -2.34939 2.137664 -0.535958
O  -2.083719 0.27902 -1.746513
O  2.21872 0.858094 1.053692
C  -4.319503 -0.937639 0.066119
C  -3.050784 -1.1514 0.818515
C  -3.393226 0.245065 0.268369
C  -5.589513 -0.870827 0.882976
C  -4.5422 -1.548661 -1.294908
C  -1.925586 -1.953592 0.292778
C  -2.561294 0.837393 -0.785531
C  -0.780843 -2.196273 0.940782
C  0.270628 -3.079184 0.340625
C  -0.428176 -1.628446 2.280475
C  -1.495954 2.855136 -1.416727
C  -0.034716 2.536406 -1.2416
C  0.446534 1.787168 -0.175511
C  0.863399 3.049582 -2.173413
C  1.810649 1.563958 -0.049452
C  2.22403 2.831116 -2.026937
C  2.713853 2.08998 -0.961415
C  3.147879 -0.1416 0.9403
C  3.322374 -0.891189 -0.216974
C  3.885191 -0.425222 2.082931
C  4.257326 -1.917879 -0.223388
C  4.806671 -1.461301 2.06347
C  5.003359 -2.209042 0.910006
H  -3.163493 -1.182635 1.897253
H  -3.715776 0.956563 1.019035
H  -6.350064 -0.27583 0.374208
H  -5.419146 -0.426815 1.864435
H  -5.997185 -1.871688 1.03646
H  -4.981372 -2.540931 -1.176527
H  -3.64365 -1.65905 -1.894222
H  -5.248967 -0.945955 -1.867731
H  -2.05497 -2.412108 -0.681666
H  0.461398 -3.948153 0.975999
H  1.222286 -2.549354 0.251853
H  -0.008941 -3.439823 -0.649115
H  -1.211438 -1.011438 2.716933
H  0.471667 -1.012986 2.204571
H  -0.193169 -2.426928 2.988907
H  -1.670804 3.904709 -1.178449
H  -1.795285 2.707004 -2.45667
H  -0.214566 1.372712 0.576287
H  0.497466 3.627518 -3.013475
H  2.915962 3.242705 -2.749812
H  3.778348 1.928046 -0.851498
H  2.740032 -0.692877 -1.107145
H  3.734413 0.160179 2.981128
H  4.392695 -2.498487 -1.126484
H  5.377479 -1.678711 2.956638
H  5.727701 -3.012268 0.895808
elementType: O C H
totalener: -1117.85389276 hartree
nucrepener: 2329.72186717 hartree
electener: -3447.57575993 hartree
oneelecener: -6149.88586200 hartree
twoeener: 2702.31010207 hartree
cpcmener: -0.03145570 hartree
kineticenergy: 1112.79604969 hartree
xcener: -110.232095113296 hartree
chargesum: 0.0000000
charge: -0.304574 -0.489102 -0.339296 0.130796 -0.022034 -0.065412 -0.258595 -0.293702 -0.257611 0.377439 -0.041363 -0.215009 -0.271464 0.088576 0.028143 -0.255405 -0.223913 0.268707 -0.135006 -0.206035 0.301625 -0.198901 -0.265895 -0.148511 -0.111988 -0.194970 0.111160 0.094495 0.095632 0.088648 0.095772 0.100823 0.091337 0.102486 0.126234 0.100516 0.069049 0.091441 0.095106 0.085770 0.107208 0.131966 0.118881 0.140040 0.145883 0.161857 0.156424 0.162192 0.146354 0.161940 0.161181 0.161106
qa: -0.3046 -0.4891 -0.3393 0.1308 -0.0220 -0.0654 -0.2586 -0.2937 -0.2576 0.3774 -0.0414 -0.2150 -0.2715 0.0886 0.0281 -0.2554 -0.2239 0.2687 -0.1350 -0.2060 0.3016 -0.1989 -0.2659 -0.1485 -0.1120 -0.1950 0.1112 0.0945 0.0956 0.0886 0.0958 0.1008 0.0913 0.1025 0.1262 0.1005 0.0690 0.0914 0.0951 0.0858 0.1072 0.1320 0.1189 0.1400 0.1459 0.1619 0.1564 0.1622 0.1464 0.1619 0.1612 0.1611
va: 2.1097 1.9898 2.0254 3.7868 3.7694 3.8375 3.8895 3.8914 3.8361 4.0885 3.7255 3.9183 3.9407 3.8069 3.6592 4.0305 3.9697 3.7556 3.8887 3.9326 3.5751 3.8431 3.9994 3.8815 3.8720 3.9004 1.0035 1.0315 1.0025 1.0046 1.0022 0.9993 1.0200 0.9990 1.0051 0.9985 1.0043 1.0108 1.0103 1.0049 0.9992 0.9913 1.0113 1.0177 0.9998 0.9889 0.9973 0.9983 1.0090 0.9898 0.9876 0.9895
dispcorr: -0.027825120 hartree
energy: -1117.881717876712
dipole: -13.89384 13.78056 -0.11328 -15.02781 15.34784 0.32003 3.70591 -3.27496 0.43095
magnitude: 0.54861 au
magnitude: 1.39445 debye
