program: Orca
programVersion: 5.0.2
elementType: O O O C C C C C C C C C C C C C C C C C C C C C C C H H H H H H H H H H H H H H H H H H H H H H H H H H
charge: 0
multiplicity: 1
keywords: wb97x-d3
keywords: def2-TZVPP
keywords: def2/J RIJCOSX
keywords: DEFGRID2
keywords: scfconv7
keywords: smallprint printgap noloewdin
keywords: NOSOSCF
formula: C23H26O3
InChI: InChI=1/C23H26O3/c1-16(2)13-20-21(23(20,3)4)22(24)25-15-17-9-8-12-19(14-17)26-18-10-6-5-7-11-18/h5-14,20-21H,15H2,1-4H3
52 atoms
O  -1.526292 2.087291 0.855713
O  -2.134036 1.180013 -1.0880
O  3.366038 0.994496 -0.300014
C  -3.590489 -0.970894 0.62598
C  -2.183341 -1.48173 0.607756
C  -2.463086 -0.020749 0.973791
C  -4.452132 -1.379249 1.797432
C  -4.370344 -0.844308 -0.659208
C  -1.48064 -1.865706 -0.63362
C  -2.046173 1.10089 0.116336
C  -0.943177 -3.065624 -0.882905
C  -0.225036 -3.324218 -2.173063
C  -0.992627 -4.240184 0.045481
C  -1.001353 3.220557 0.160892
C  0.234221 2.886254 -0.627686
C  1.217379 2.076657 -0.067851
C  0.409511 3.404252 -1.904731
C  2.354263 1.770121 -0.802209
C  1.567569 3.118916 -2.614484
C  2.540386 2.291992 -2.075866
C  3.084946 -0.028013 0.57372
C  2.028646 -0.90722 0.365699
C  3.939849 -0.189734 1.654066
C  1.827822 -1.945603 1.263087
C  3.736466 -1.244675 2.533739
C  2.676969 -2.121401 2.347642
H  -1.907073 -2.062297 1.481453
H  -2.358667 0.193483 2.03069
H  -4.916536 -2.349221 1.610413
H  -5.251501 -0.654758 1.964671
H  -3.875105 -1.459118 2.719459
H  -5.072394 -0.010417 -0.610203
H  -4.955963 -1.753558 -0.806933
H  -3.753936 -0.713432 -1.543486
H  -1.394422 -1.117529 -1.412689
H  -0.664619 -4.170497 -2.707241
H  0.820506 -3.585865 -1.989145
H  -0.242815 -2.459541 -2.836076
H  0.007773 -4.648612 0.2081
H  -1.582318 -5.046893 -0.398408
H  -1.42644 -4.017508 1.018299
H  -0.771269 3.938746 0.947832
H  -1.762084 3.667555 -0.481914
H  1.092992 1.687001 0.935046
H  -0.358768 4.027017 -2.345461
H  1.705431 3.524439 -3.608072
H  3.434601 2.051258 -2.636395
H  1.365676 -0.791965 -0.483197
H  4.759713 0.50138 1.802331
H  1.000815 -2.624759 1.105218
H  4.406153 -1.371506 3.373964
H  2.513504 -2.936641 3.039492
elementType: O C H
totalener: -1117.85361048 hartree
nucrepener: 2354.69907084 hartree
electener: -3472.55268132 hartree
oneelecener: -6199.45441212 hartree
twoeener: 2726.90173081 hartree
cpcmener: -0.02956252 hartree
kineticenergy: 1112.79721866 hartree
xcener: -110.231221124281 hartree
chargesum: 0.0000000
charge: -0.301254 -0.493166 -0.342220 0.143729 0.010441 -0.103101 -0.266706 -0.290758 -0.340653 0.410234 -0.020697 -0.235697 -0.268645 0.106130 0.035737 -0.252346 -0.237957 0.298252 -0.109336 -0.268488 0.310599 -0.246847 -0.269551 -0.062306 -0.095319 -0.259615 0.114785 0.099077 0.094710 0.095343 0.088962 0.105693 0.095933 0.095698 0.128690 0.102471 0.093197 0.091798 0.093033 0.114122 0.096907 0.123635 0.116578 0.140640 0.145538 0.160900 0.148612 0.160297 0.147727 0.177312 0.161026 0.156858
qa: -0.3013 -0.4932 -0.3422 0.1437 0.0104 -0.1031 -0.2667 -0.2908 -0.3407 0.4102 -0.0207 -0.2357 -0.2686 0.1061 0.0357 -0.2523 -0.2380 0.2983 -0.1093 -0.2685 0.3106 -0.2468 -0.2696 -0.0623 -0.0953 -0.2596 0.1148 0.0991 0.0947 0.0953 0.0890 0.1057 0.0959 0.0957 0.1287 0.1025 0.0932 0.0918 0.0930 0.1141 0.0969 0.1236 0.1166 0.1406 0.1455 0.1609 0.1486 0.1603 0.1477 0.1773 0.1610 0.1569
va: 2.1117 1.9935 2.0715 3.7441 3.7254 3.9209 3.9060 3.9045 3.8013 4.0590 3.7143 3.9161 3.9229 3.7949 3.6143 3.9202 3.9677 3.6963 3.8847 4.0125 3.7199 3.9399 4.0233 3.7536 3.8521 3.9997 1.0038 1.0286 1.0020 1.0018 1.0048 0.9999 1.0014 1.0127 1.0207 0.9978 0.9957 1.0074 0.9953 0.9970 1.0093 0.9930 1.0088 1.0179 1.0025 0.9876 1.0062 0.9954 1.0072 0.9652 0.9872 0.9956
dispcorr: -0.028125024 hartree
energy: -1117.881735499691
dipole: -17.89387 17.40025 -0.49362 -20.79523 20.24982 -0.54542 0.39120 0.80340 1.19460
magnitude: 1.40293 au
magnitude: 3.56596 debye
