program: Orca
programVersion: 5.0.2
elementType: O O O C C C C C C C C C C C C C C C C C C C C C C C H H H H H H H H H H H H H H H H H H H H H H H H H H
charge: 0
multiplicity: 1
keywords: wb97x-d3
keywords: def2-TZVPP
keywords: def2/J RIJCOSX
keywords: DEFGRID2
keywords: scfconv7
keywords: smallprint printgap noloewdin
keywords: NOSOSCF
formula: C23H26O3
InChI: InChI=1/C23H26O3/c1-16(2)13-20-21(23(20,3)4)22(24)25-15-17-9-8-12-19(14-17)26-18-10-6-5-7-11-18/h5-14,20-21H,15H2,1-4H3
52 atoms
O  -1.725654 1.042958 -0.524828
O  -3.855668 1.609008 -0.218659
O  3.258129 0.799038 0.078209
C  -2.569266 -1.857139 -0.757522
C  -2.432452 -1.623549 0.706422
C  -3.297739 -0.678727 -0.135137
C  -3.480835 -2.982824 -1.190239
C  -1.39287 -1.681316 -1.686273
C  -1.158902 -1.200829 1.341782
C  -2.996913 0.753187 -0.297841
C  -1.075418 -0.497207 2.474127
C  0.24677 -0.151691 3.085467
C  -2.272438 0.012489 3.215364
C  -1.351529 2.416226 -0.617247
C  0.133051 2.496797 -0.824319
C  0.99802 1.556178 -0.277003
C  0.652513 3.574578 -1.535533
C  2.367473 1.690709 -0.46684
C  2.02311 3.711214 -1.691589
C  2.891914 2.764647 -1.16887
C  2.983982 -0.545664 0.025875
C  3.328959 -1.306486 1.134015
C  2.433163 -1.142879 -1.101347
C  3.113513 -2.677459 1.114436
C  2.215574 -2.513406 -1.103036
C  2.548962 -3.285915 0.001888
H  -3.048338 -2.264998 1.33158
H  -4.363948 -0.826609 -0.009858
H  -4.330198 -3.100797 -0.516692
H  -2.936327 -3.928834 -1.207863
H  -3.871874 -2.805998 -2.193827
H  -0.894967 -2.644481 -1.81488
H  -0.644209 -0.976558 -1.336426
H  -1.726224 -1.354106 -2.672618
H  -0.236552 -1.526827 0.866481
H  0.30606 -0.502533 4.119037
H  0.389305 0.931782 3.118522
H  1.080764 -0.584738 2.533991
H  -2.178496 1.084485 3.40585
H  -2.35158 -0.466862 4.194856
H  -3.209941 -0.15376 2.687732
H  -1.632349 2.939091 0.301321
H  -1.872683 2.899545 -1.446251
H  0.613285 0.721772 0.296629
H  -0.016238 4.307704 -1.969296
H  2.420805 4.55214 -2.243996
H  3.961593 2.857154 -1.305455
H  3.760291 -0.828885 2.00457
H  2.17611 -0.554274 -1.972872
H  3.38043 -3.268242 1.98082
H  1.784468 -2.977296 -1.980524
H  2.376347 -4.353667 -0.007766
elementType: O C H
totalener: -1117.85133860 hartree
nucrepener: 2403.27873445 hartree
electener: -3521.13007305 hartree
oneelecener: -6295.63593721 hartree
twoeener: 2774.50586415 hartree
cpcmener: -0.02977102 hartree
kineticenergy: 1112.80084104 hartree
xcener: -110.233876313563 hartree
chargesum: 0.0000000
charge: -0.263612 -0.511572 -0.343718 0.156614 -0.005553 -0.148098 -0.271479 -0.274482 -0.220107 0.431334 -0.033661 -0.218735 -0.268042 0.071125 0.020587 -0.162429 -0.227528 0.263729 -0.128407 -0.232596 0.287331 -0.233725 -0.183929 -0.140580 -0.176541 -0.166188 0.111568 0.095220 0.088020 0.094272 0.096497 0.099652 0.052526 0.109837 0.085172 0.109020 0.098065 0.071288 0.097267 0.110758 0.090905 0.120210 0.116090 0.083711 0.144423 0.160509 0.147870 0.152214 0.157588 0.160695 0.166302 0.160580
qa: -0.2636 -0.5116 -0.3437 0.1566 -0.0056 -0.1481 -0.2715 -0.2745 -0.2201 0.4313 -0.0337 -0.2187 -0.2680 0.0711 0.0206 -0.1624 -0.2275 0.2637 -0.1284 -0.2326 0.2873 -0.2337 -0.1839 -0.1406 -0.1765 -0.1662 0.1116 0.0952 0.0880 0.0943 0.0965 0.0997 0.0525 0.1098 0.0852 0.1090 0.0981 0.0713 0.0973 0.1108 0.0909 0.1202 0.1161 0.0837 0.1444 0.1605 0.1479 0.1522 0.1576 0.1607 0.1663 0.1606
va: 2.1197 1.9857 2.0668 3.7193 3.7778 3.8766 3.9058 3.9149 3.7974 4.0864 3.6986 3.8995 3.9419 3.8099 3.7488 3.8491 3.9511 3.7081 3.8993 3.9927 3.6436 3.9450 3.8222 3.8792 3.8547 3.8708 1.0067 1.0288 1.0052 1.0017 1.0016 0.9975 1.0007 1.0054 1.0065 1.0009 0.9993 1.0143 0.9986 0.9977 1.0080 0.9933 1.0032 1.0320 1.0014 0.9880 1.0059 1.0058 0.9971 0.9882 0.9865 0.9894
dispcorr: -0.031788383 hartree
energy: -1117.883126983000
dipole: -10.31890 10.90922 0.59033 -12.27611 11.34787 -0.92824 5.87469 -5.96707 -0.09239
magnitude: 1.10393 au
magnitude: 2.80596 debye
