program: Orca
programVersion: 5.0.2
elementType: O O O C C C C C C C C C C C C C C C C C C C C C C C H H H H H H H H H H H H H H H H H H H H H H H H H H
charge: 0
multiplicity: 1
keywords: wb97x-d3
keywords: def2-TZVPP
keywords: def2/J RIJCOSX
keywords: DEFGRID2
keywords: scfconv7
keywords: smallprint printgap noloewdin
keywords: NOSOSCF
formula: C23H26O3
InChI: InChI=1/C23H26O3/c1-16(2)13-20-21(23(20,3)4)22(24)25-15-17-9-8-12-19(14-17)26-18-10-6-5-7-11-18/h5-14,20-21H,15H2,1-4H3
52 atoms
O  -1.114245 -0.018368 2.05809
O  -2.733358 1.247627 1.176017
O  3.583599 0.845951 -0.421923
C  -4.125824 -1.404262 0.35744
C  -3.105703 -1.165257 -0.69924
C  -2.699752 -1.11749 0.785503
C  -4.560304 -2.835021 0.577791
C  -5.244781 -0.419131 0.592675
C  -3.093085 0.049087 -1.547628
C  -2.231605 0.159006 1.342289
C  -1.996143 0.510595 -2.154596
C  -2.031697 1.727839 -3.023614
C  -0.657453 -0.150706 -1.978886
C  -0.382399 1.147202 2.472999
C  0.455208 1.661672 1.336132
C  1.631485 0.991256 1.008437
C  0.053675 2.760078 0.582968
C  2.385325 1.412731 -0.078116
C  0.821089 3.177191 -0.495948
C  1.980531 2.501089 -0.839781
C  3.815208 -0.495494 -0.254247
C  5.096391 -0.86014 0.135177
C  2.854365 -1.461903 -0.525789
C  5.419308 -2.204458 0.250713
C  3.188405 -2.802321 -0.392164
C  4.466858 -3.181184 -0.005303
H  -2.716753 -2.057547 -1.184555
H  -2.138374 -1.978522 1.128349
H  -4.907247 -2.9851 1.601745
H  -3.749076 -3.540091 0.392284
H  -5.382963 -3.090954 -0.09252
H  -4.986994 0.612621 0.373235
H  -5.58233 -0.464848 1.629611
H  -6.095242 -0.685036 -0.038448
H  -4.033057 0.571584 -1.695579
H  -1.66875 1.503973 -4.029879
H  -1.373123 2.505248 -2.625536
H  -3.034852 2.144994 -3.108971
H  -0.674338 -1.193103 -2.305615
H  -0.346456 -0.158064 -0.93134
H  0.120056 0.357319 -2.54863
H  0.245362 0.801916 3.292889
H  -1.051837 1.915848 2.859774
H  1.952952 0.151128 1.612987
H  -0.850454 3.295446 0.84018
H  0.5111 4.032655 -1.081288
H  2.577102 2.821904 -1.684127
H  5.83606 -0.096563 0.339411
H  1.85736 -1.1842 -0.843737
H  6.420266 -2.485269 0.550778
H  2.439676 -3.554698 -0.60222
H  4.719549 -4.22845 0.091467
elementType: O C H
totalener: -1117.85192395 hartree
nucrepener: 2337.43089987 hartree
electener: -3455.28282382 hartree
oneelecener: -6164.75764149 hartree
twoeener: 2709.47481767 hartree
cpcmener: -0.03010024 hartree
kineticenergy: 1112.78893086 hartree
xcener: -110.226787655602 hartree
chargesum: -0.0000000
charge: -0.297038 -0.491914 -0.337839 0.135813 -0.027807 -0.101105 -0.264068 -0.296596 -0.279672 0.402817 -0.010463 -0.220009 -0.279709 0.072252 0.016769 -0.237295 -0.196826 0.319981 -0.141288 -0.257499 0.249677 -0.228012 -0.146151 -0.141911 -0.196530 -0.167252 0.114147 0.092952 0.095830 0.087522 0.094828 0.090607 0.101722 0.099767 0.127124 0.102263 0.093652 0.088812 0.120822 0.068334 0.108139 0.124491 0.116000 0.141132 0.141670 0.161608 0.146484 0.147248 0.176740 0.160538 0.158351 0.160891
qa: -0.2970 -0.4919 -0.3378 0.1358 -0.0278 -0.1011 -0.2641 -0.2966 -0.2797 0.4028 -0.0105 -0.2200 -0.2797 0.0723 0.0168 -0.2373 -0.1968 0.3200 -0.1413 -0.2575 0.2497 -0.2280 -0.1462 -0.1419 -0.1965 -0.1673 0.1141 0.0930 0.0958 0.0875 0.0948 0.0906 0.1017 0.0998 0.1271 0.1023 0.0937 0.0888 0.1208 0.0683 0.1081 0.1245 0.1160 0.1411 0.1417 0.1616 0.1465 0.1472 0.1767 0.1605 0.1584 0.1609
va: 2.1012 1.9908 2.0712 3.7611 3.8080 3.8354 3.8971 3.8891 3.8022 4.0996 3.6857 3.9117 3.9354 3.8235 3.5768 3.9384 3.8663 3.6521 3.8685 3.9525 3.7111 3.9802 3.8471 3.8915 3.9482 3.8793 1.0061 1.0331 1.0026 1.0046 1.0022 1.0179 1.0002 0.9984 0.9988 0.9944 0.9946 1.0084 1.0013 0.9996 0.9987 0.9961 1.0107 1.0089 1.0161 0.9882 1.0072 1.0077 0.9617 0.9883 0.9932 0.9895
dispcorr: -0.029175498 hartree
energy: -1117.881099444917
dipole: -20.43467 20.77436 0.33969 -6.67433 5.47674 -1.19759 -7.95229 7.95525 0.00296
magnitude: 1.24484 au
magnitude: 3.16412 debye
