program: Orca
programVersion: 5.0.2
elementType: O O O C C C C C C C C C C C C C C C C C C C C C C C H H H H H H H H H H H H H H H H H H H H H H H H H H
charge: 0
multiplicity: 1
keywords: wb97x-d3
keywords: def2-TZVPP
keywords: def2/J RIJCOSX
keywords: DEFGRID2
keywords: scfconv7
keywords: smallprint printgap noloewdin
keywords: NOSOSCF
formula: C23H26O3
InChI: InChI=1/C23H26O3/c1-16(2)13-20-21(23(20,3)4)22(24)25-15-17-9-8-12-19(14-17)26-18-10-6-5-7-11-18/h5-14,20-21H,15H2,1-4H3
52 atoms
O  -1.765504 0.538327 -1.367495
O  -2.768095 2.496642 -1.006797
O  3.049469 1.079984 0.796934
C  -3.994726 -0.847435 0.098722
C  -3.081564 -0.392886 1.189666
C  -3.573721 0.611832 0.154324
C  -5.438064 -1.084025 0.479937
C  -3.525757 -1.785635 -0.987243
C  -1.645577 -0.759198 1.300147
C  -2.676172 1.307001 -0.785406
C  -1.180616 -1.980953 1.572104
C  0.28979 -2.226365 1.719583
C  -2.051115 -3.184515 1.757529
C  -0.817373 1.148833 -2.253001
C  0.278627 1.848073 -1.500263
C  1.147209 1.099206 -0.709008
C  0.434826 3.22527 -1.589215
C  2.178471 1.734664 -0.0321
C  1.46445 3.850914 -0.899171
C  2.341527 3.112052 -0.123579
C  3.443767 -0.211846 0.557756
C  3.68708 -0.702903 -0.719099
C  3.659266 -1.007639 1.674978
C  4.1271 -2.011298 -0.867004
C  4.110752 -2.30895 1.512014
C  4.339398 -2.819785 0.241352
H  -3.56844 -0.244154 2.151161
H  -4.338588 1.290855 0.512387
H  -6.095618 -0.968069 -0.383747
H  -5.776258 -0.391546 1.251728
H  -5.568455 -2.098409 0.862843
H  -3.85016 -2.798971 -0.744391
H  -2.447652 -1.814985 -1.112854
H  -3.975233 -1.526905 -1.947593
H  -0.927518 0.052416 1.222516
H  0.644105 -2.952387 0.9832
H  0.524671 -2.643436 2.702213
H  0.868488 -1.312048 1.595806
H  -1.805105 -3.958609 1.026577
H  -3.11379 -2.964784 1.673529
H  -1.878979 -3.627415 2.742002
H  -1.315268 1.827555 -2.946464
H  -0.414594 0.317486 -2.829675
H  1.014657 0.025895 -0.635097
H  -0.242809 3.807955 -2.199916
H  1.587262 4.923747 -0.96598
H  3.147997 3.595803 0.41259
H  3.538428 -0.082346 -1.593382
H  3.471738 -0.609177 2.664029
H  4.310776 -2.395629 -1.861753
H  4.277439 -2.926202 2.385018
H  4.684015 -3.837429 0.115807
elementType: O C H
totalener: -1117.84941647 hartree
nucrepener: 2336.76821653 hartree
electener: -3454.61763301 hartree
oneelecener: -6163.09442875 hartree
twoeener: 2708.47679575 hartree
cpcmener: -0.03132652 hartree
kineticenergy: 1112.80602773 hartree
xcener: -110.231886814797 hartree
chargesum: -0.0000000
charge: -0.271629 -0.508036 -0.341316 0.093177 0.004689 -0.114181 -0.275490 -0.288954 -0.294781 0.431689 -0.011781 -0.240394 -0.265491 0.065678 0.027477 -0.298168 -0.204138 0.347417 -0.121840 -0.261345 0.331461 -0.218028 -0.300459 -0.134490 -0.101829 -0.198761 0.114431 0.093346 0.099001 0.088619 0.091698 0.093769 0.096615 0.113615 0.135359 0.099107 0.107308 0.081442 0.101640 0.091737 0.108517 0.119541 0.121441 0.146076 0.144355 0.160265 0.148006 0.158301 0.149996 0.163414 0.160903 0.161023
qa: -0.2716 -0.5080 -0.3413 0.0932 0.0047 -0.1142 -0.2755 -0.2890 -0.2948 0.4317 -0.0118 -0.2404 -0.2655 0.0657 0.0275 -0.2982 -0.2041 0.3474 -0.1218 -0.2613 0.3315 -0.2180 -0.3005 -0.1345 -0.1018 -0.1988 0.1144 0.0933 0.0990 0.0886 0.0917 0.0938 0.0966 0.1136 0.1354 0.0991 0.1073 0.0814 0.1016 0.0917 0.1085 0.1195 0.1214 0.1461 0.1444 0.1603 0.1480 0.1583 0.1500 0.1634 0.1609 0.1610
va: 2.1125 1.9937 2.0611 3.6830 3.7890 3.8622 3.9115 3.8755 3.8591 4.1222 3.7024 3.9399 3.9380 3.8181 3.6364 3.9253 3.9502 3.6420 3.9024 4.0141 3.5961 3.9108 3.9669 3.8745 3.8310 3.9056 1.0054 1.0266 1.0004 1.0055 1.0034 0.9985 1.0098 1.0028 0.9927 0.9954 0.9974 0.9944 0.9957 1.0047 1.0001 1.0069 0.9984 0.9980 1.0084 0.9884 1.0064 0.9966 1.0095 0.9882 0.9881 0.9896
dispcorr: -0.029225406 hartree
energy: -1117.878641877481
dipole: -16.28242 16.47997 0.19755 -20.18969 18.24058 -1.94911 4.64404 -4.86466 -0.22062
magnitude: 1.97148 au
magnitude: 5.01110 debye
