program: Orca
programVersion: 5.0.2
elementType: O O O C C C C C C C C C C C C C C C C C C C C C C C H H H H H H H H H H H H H H H H H H H H H H H H H H
charge: 0
multiplicity: 1
keywords: wb97x-d3
keywords: def2-TZVPP
keywords: def2/J RIJCOSX
keywords: DEFGRID2
keywords: scfconv7
keywords: smallprint printgap noloewdin
keywords: NOSOSCF
formula: C23H26O3
InChI: InChI=1/C23H26O3/c1-16(2)13-20-21(23(20,3)4)22(24)25-15-17-9-8-12-19(14-17)26-18-10-6-5-7-11-18/h5-14,20-21H,15H2,1-4H3
52 atoms
O  -1.137509 0.008608 2.003915
O  -2.733221 1.238929 1.034809
O  3.610412 0.895727 -0.351323
C  -4.136328 -1.438727 0.33889
C  -3.098736 -1.272356 -0.715886
C  -2.710816 -1.143619 0.76555
C  -4.590575 -2.849862 0.633299
C  -5.246616 -0.430207 0.505069
C  -3.071239 -0.107367 -1.634329
C  -2.240597 0.156972 1.261421
C  -1.971077 0.381382 -2.212944
C  -2.032434 1.5448 -3.153304
C  -0.598473 -0.162348 -1.9666
C  -0.437736 1.192174 2.421724
C  0.42987 1.708351 1.308975
C  1.611095 1.034097 1.00979
C  0.062097 2.822322 0.56215
C  2.407348 1.470598 -0.039286
C  0.872576 3.255389 -0.478436
C  2.040624 2.579088 -0.791444
C  3.818222 -0.450399 -0.184614
C  2.865608 -1.400624 -0.531411
C  5.065982 -0.835821 0.283782
C  3.17363 -2.746746 -0.394137
C  5.364429 -2.185839 0.402361
C  4.419656 -3.146704 0.070293
H  -2.724282 -2.198335 -1.144272
H  -2.163725 -1.990028 1.16345
H  -4.965328 -2.935204 1.654843
H  -3.782195 -3.571775 0.511542
H  -5.398502 -3.138506 -0.041724
H  -5.580517 -0.396857 1.543498
H  -6.101606 -0.73645 -0.101154
H  -4.983626 0.580577 0.208054
H  -4.02369 0.360065 -1.866351
H  -1.450438 2.385057 -2.76427
H  -3.053261 1.888584 -3.318403
H  -1.597829 1.291882 -4.123476
H  -0.180188 -0.585533 -2.88389
H  -0.572682 -0.93552 -1.200544
H  0.081731 0.637488 -1.663224
H  0.168678 0.869377 3.266658
H  -1.132091 1.954455 2.775822
H  1.905043 0.181433 1.610711
H  -0.848026 3.358716 0.795976
H  0.589398 4.123293 -1.059123
H  2.670635 2.912773 -1.606036
H  1.895184 -1.105948 -0.910455
H  5.799893 -0.084756 0.546233
H  2.431218 -3.486871 -0.661838
H  6.340054 -2.4833 0.763361
H  4.652909 -4.198254 0.169533
elementType: O C H
totalener: -1117.85332079 hartree
nucrepener: 2335.00564273 hartree
electener: -3452.85896352 hartree
oneelecener: -6159.95201086 hartree
twoeener: 2707.09304734 hartree
cpcmener: -0.02999478 hartree
kineticenergy: 1112.79946973 hartree
xcener: -110.229507113228 hartree
chargesum: 0.0000000
charge: -0.293967 -0.494067 -0.339077 0.141906 -0.017082 -0.114703 -0.265088 -0.300990 -0.289628 0.405130 -0.013867 -0.225570 -0.235029 0.080816 -0.002627 -0.225333 -0.188553 0.292704 -0.152969 -0.219695 0.223571 -0.124993 -0.213811 -0.205965 -0.148975 -0.157861 0.114068 0.095943 0.095242 0.087814 0.094657 0.102297 0.099127 0.091873 0.125638 0.093075 0.091347 0.098231 0.121554 0.095963 0.048809 0.125442 0.115186 0.142856 0.141782 0.159784 0.145725 0.171992 0.147375 0.158080 0.160718 0.161143
qa: -0.2940 -0.4941 -0.3391 0.1419 -0.0171 -0.1147 -0.2651 -0.3010 -0.2896 0.4051 -0.0139 -0.2256 -0.2350 0.0808 -0.0026 -0.2253 -0.1886 0.2927 -0.1530 -0.2197 0.2236 -0.1250 -0.2138 -0.2060 -0.1490 -0.1579 0.1141 0.0959 0.0952 0.0878 0.0947 0.1023 0.0991 0.0919 0.1256 0.0931 0.0913 0.0982 0.1216 0.0960 0.0488 0.1254 0.1152 0.1429 0.1418 0.1598 0.1457 0.1720 0.1474 0.1581 0.1607 0.1611
va: 2.1087 1.9904 2.0705 3.7401 3.8053 3.8332 3.8995 3.8910 3.8568 4.1058 3.7148 3.9236 3.9156 3.8146 3.6118 3.9377 3.8642 3.6893 3.8934 3.9337 3.7397 3.8303 3.9697 3.9513 3.8973 3.8725 1.0055 1.0307 1.0026 1.0044 1.0021 1.0002 0.9982 1.0164 0.9991 0.9962 1.0074 0.9958 1.0012 1.0014 1.0146 0.9964 1.0108 1.0085 1.0149 0.9904 1.0068 0.9655 1.0074 0.9934 0.9885 0.9894
dispcorr: -0.028835040 hartree
energy: -1117.882155832627
dipole: -20.49929 20.81484 0.31555 -7.00172 5.81623 -1.18550 -8.06571 8.15766 0.09195
magnitude: 1.23022 au
magnitude: 3.12696 debye
