program: Orca
programVersion: 5.0.2
elementType: O O O C C C C C C C C C C C C C C C C C C C C C C C H H H H H H H H H H H H H H H H H H H H H H H H H H
charge: 0
multiplicity: 1
keywords: wb97x-d3
keywords: def2-TZVPP
keywords: def2/J RIJCOSX
keywords: DEFGRID2
keywords: scfconv7
keywords: smallprint printgap noloewdin
keywords: NOSOSCF
formula: C23H26O3
InChI: InChI=1/C23H26O3/c1-16(2)13-20-21(23(20,3)4)22(24)25-15-17-9-8-12-19(14-17)26-18-10-6-5-7-11-18/h5-14,20-21H,15H2,1-4H3
52 atoms
O  -1.663711 0.074128 1.433803
O  -0.378664 -1.722735 1.102591
O  3.592055 0.907004 -0.013912
C  -3.892761 -1.457852 -0.002526
C  -3.186455 -0.691581 -1.06597
C  -2.381037 -1.571999 -0.111751
C  -4.642015 -2.703289 -0.417479
C  -4.551807 -0.741239 1.150076
C  -3.138296 0.792492 -1.086389
C  -1.384571 -1.086831 0.858335
C  -2.136182 1.529114 -1.572488
C  -2.240135 3.021007 -1.659695
C  -0.851746 0.948249 -2.075934
C  -0.711817 0.652074 2.347729
C  0.331242 1.422254 1.591508
C  1.516912 0.805662 1.210522
C  0.089232 2.739866 1.214481
C  2.421572 1.484911 0.406491
C  1.022742 3.424892 0.450564
C  2.185406 2.797962 0.0264
C  3.602625 -0.43083 -0.330284
C  2.560983 -1.034265 -1.026067
C  4.7252 -1.158752 0.035585
C  2.645258 -2.383958 -1.333715
C  4.80237 -2.505315 -0.293342
C  3.761668 -3.12596 -0.969903
H  -3.235184 -1.139427 -2.055888
H  -2.040655 -2.500628 -0.554764
H  -4.155824 -3.212685 -1.250172
H  -5.65802 -2.452901 -0.728562
H  -4.713156 -3.410595 0.41091
H  -5.602076 -0.566617 0.908722
H  -4.112113 0.223711 1.385604
H  -4.522529 -1.353832 2.052706
H  -4.028352 1.306743 -0.734043
H  -2.189157 3.351952 -2.700379
H  -1.410274 3.507247 -1.142195
H  -3.171489 3.393345 -1.233575
H  -0.800247 -0.134835 -1.978083
H  -0.001071 1.379038 -1.540459
H  -0.703852 1.19547 -3.13058
H  -0.270935 -0.114414 2.984648
H  -1.304074 1.316183 2.974376
H  1.722567 -0.206273 1.532189
H  -0.82872 3.228737 1.516419
H  0.837168 4.451238 0.162652
H  2.902278 3.32214 -0.592615
H  1.688845 -0.467117 -1.326815
H  5.53138 -0.675782 0.57303
H  1.83059 -2.8539 -1.868935
H  5.679002 -3.071274 -0.00674
H  3.820401 -4.177918 -1.214746
elementType: O C H
totalener: -1117.84986513 hartree
nucrepener: 2380.64737023 hartree
electener: -3498.49723535 hartree
oneelecener: -6251.42120273 hartree
twoeener: 2752.92396738 hartree
cpcmener: -0.03085737 hartree
kineticenergy: 1112.80912630 hartree
xcener: -110.232753783741 hartree
chargesum: 0.0000000
charge: -0.266438 -0.509968 -0.342677 0.141281 -0.007734 -0.157613 -0.269711 -0.298009 -0.266802 0.446804 -0.038383 -0.227928 -0.237329 0.051413 0.010074 -0.187267 -0.248640 0.278048 -0.123645 -0.225422 0.260892 -0.162826 -0.227544 -0.190044 -0.142669 -0.165439 0.116220 0.096592 0.087417 0.093688 0.096028 0.098585 0.093901 0.104308 0.124646 0.102860 0.089714 0.092478 0.093769 0.058914 0.115966 0.122906 0.118155 0.143777 0.151462 0.161812 0.147236 0.168214 0.147231 0.159327 0.161125 0.161243
qa: -0.2664 -0.5100 -0.3427 0.1413 -0.0077 -0.1576 -0.2697 -0.2980 -0.2668 0.4468 -0.0384 -0.2279 -0.2373 0.0514 0.0101 -0.1873 -0.2486 0.2780 -0.1236 -0.2254 0.2609 -0.1628 -0.2275 -0.1900 -0.1427 -0.1654 0.1162 0.0966 0.0874 0.0937 0.0960 0.0986 0.0939 0.1043 0.1246 0.1029 0.0897 0.0925 0.0938 0.0589 0.1160 0.1229 0.1182 0.1438 0.1515 0.1618 0.1472 0.1682 0.1472 0.1593 0.1611 0.1612
va: 2.1209 1.9806 2.0714 3.7131 3.7837 3.8592 3.9037 3.9022 3.8419 4.0713 3.6987 3.9121 3.9435 3.8289 3.5871 3.8787 3.9087 3.7234 3.8541 3.9733 3.7027 3.8304 3.9853 3.9300 3.8909 3.8810 1.0036 1.0280 1.0057 1.0020 1.0014 0.9987 1.0090 1.0007 1.0003 0.9967 1.0010 1.0074 1.0051 1.0097 1.0040 1.0099 0.9997 1.0248 0.9990 0.9877 1.0057 0.9799 1.0073 0.9924 0.9881 0.9889
dispcorr: -0.030797358 hartree
energy: -1117.880662485172
dipole: -23.63286 22.24117 -1.39169 0.50082 0.17393 0.67474 -7.11302 6.83775 -0.27526
magnitude: 1.57093 au
magnitude: 3.99300 debye
