program: Gaussian 09
title: 000071736
version: EM64L-G09RevD.01
frameworkgroup: C1[X(C18H15Cl2N5O5S3)]
method: RPBEPBE
basis: SDD
operation: Freq
keyword: #p
keyword: freq=noraman
keyword: PBEPBE/SDD
title: #p freq=noraman PBEPBE/SDD
converged: YES YES NO NO
title: Mulliken charges:
elementType: Cl Cl S S S O O O O O N N N N N C C C C C C C C C C C C C C C C C C H H H H H H H H H H H H H H H
charge: 0.003232 0.000244 0.206376 0.343474 0.270946 -0.145304 -0.402833 -0.238998 -0.236704 -0.217397 -0.159003 -0.368060 -0.086103 -0.066400 -0.053518 -0.488865 -0.175648 0.112698 0.174581 0.457150 -0.839275 -0.863067 0.303970 0.125105 -0.551746 -0.106206 -0.132638 -0.445540 -0.253712 -0.250506 0.374252 -0.053608 -0.719215 0.333132 0.316271 0.293585 0.360849 0.325638 0.310068 0.317997 0.228718 0.278186 0.394789 0.296775 0.265111 0.266590 0.247480 0.247128
chargesum: 0.00000
title: Mulliken charges with hydrogens summed into heavy atoms:
elementType: Cl Cl S S S O O O O O N N N N N C C C C C C C C C C C C C C C C C C
charge: 0.003232 0.000244 0.206376 0.343474 0.270946 -0.145304 -0.008044 -0.238998 -0.236704 -0.217397 -0.159003 -0.042422 -0.086103 -0.066400 -0.053518 -0.155733 0.140623 0.112698 0.174581 0.457150 -0.184841 -0.235002 0.303970 0.125105 -0.044843 0.190568 0.132473 -0.445540 -0.253712 -0.250506 0.374252 -0.053608 0.041983
polarizability: 4.08070275e+02 4.05007359e+01 4.04438161e+02 4.31247934e+01 -2.04509898e+01 2.06448468e+02
1716.lowfreq: -6.7703 -3.6391 -1.5175 -0.0015 0.0013 0.0015 4.2296 7.3418 13.3283
frequency: 3.5752 6.5922 13.1851 14.7296 25.8196 33.1745 36.9373 48.9406 58.1784 64.5349 74.9394 81.2244 88.4688 102.2033 115.3376 120.9108 135.5274 138.4009 147.4517 173.0807 176.9983 189.5223 211.4105 217.9022 221.5030 235.5680 259.3777 267.9059 285.5835 301.3903 308.5299 316.4979 322.5356 344.3078 347.7670 360.6614 395.5154 405.0033 408.0865 423.2431 449.3571 457.9535 469.7979 485.9114 504.0677 519.6795 521.2537 523.7011 528.5236 542.0723 572.7507 583.6438 585.8072 589.2254 597.1522 605.2367 617.6098 655.7846 679.2725 706.3369 719.3948 728.1749 734.8937 743.3791 750.8890 764.0525 788.3207 814.5276 831.8324 852.4578 864.3722 878.2718 894.7576 914.7522 921.6535 926.7659 951.3697 955.4924 963.1046 979.0182 1023.4167 1032.7189 1037.5250 1058.4991 1077.6349 1094.6019 1114.9305 1142.8758 1146.8200 1155.6145 1175.7076 1181.6192 1191.5664 1207.5025 1218.0590 1228.6531 1242.4725 1252.0444 1260.6006 1295.0825 1299.4782 1319.8195 1335.1360 1336.3270 1345.6313 1357.2857 1390.2940 1396.7595 1432.6455 1433.2505 1440.2688 1444.9525 1455.2048 1456.9557 1492.9005 1498.1936 1550.0915 1562.0375 1605.1434 1623.6319 1627.9863 1633.1181 1737.1445 2977.6963 2994.9524 3022.8004 3038.5437 3057.0991 3063.4300 3078.0219 3084.8853 3089.1080 3116.3144 3143.5504 3181.1710 3200.8572 3531.5607 3532.4592
redmass: 13.2894 15.3371 9.5953 7.8476 10.7966 11.0442 9.9639 7.9743 10.7385 9.9626 16.7542 11.3459 8.3262 6.7526 8.1749 1.6334 6.9120 2.3541 7.9001 5.5287 7.7028 10.3068 5.7335 5.1823 5.6434 4.9336 7.9319 9.1682 7.9227 6.5108 5.1789 4.9169 4.9581 7.3992 18.4684 3.2658 6.1453 8.6395 6.1587 4.9622 4.6320 4.7901 4.6062 4.4701 4.0336 7.2621 3.6343 5.4694 3.7043 4.3675 11.8733 4.4590 9.9770 4.6610 1.8827 1.6690 3.5675 3.7008 5.6538 5.1125 8.7130 5.8143 7.4524 7.6930 11.0409 10.3413 8.5408 4.8560 1.4108 1.4751 2.2516 2.0764 4.0686 4.9470 3.7117 3.3648 3.2737 9.4774 4.4143 2.9917 6.1590 2.9573 1.4146 3.9847 3.8860 2.1106 3.1675 1.8951 3.1303 2.3181 1.4463 1.2388 1.6416 2.6344 1.5480 1.2628 1.2147 1.4772 1.5522 1.5869 2.1254 1.7622 5.6578 1.8180 1.8276 1.7168 6.1226 1.2294 1.1106 3.6377 1.1230 1.4545 1.0437 1.1200 1.8094 2.7150 7.6727 10.0284 7.4054 8.2180 6.7367 6.7745 12.8373 1.0593 1.0367 1.0598 1.1034 1.0587 1.0845 1.0983 1.0898 1.1048 1.0989 1.1077 1.0940 1.0952 1.0646 1.0782
irintensity: 0.8207 0.4242 0.5278 0.3360 1.4326 4.9185 5.6129 1.1604 7.3114 0.2513 1.6702 2.2618 0.2289 2.7922 0.5441 2.3408 0.1844 6.5883 6.4759 5.4264 1.1309 1.9612 5.4715 2.8688 11.7471 3.9676 0.2352 1.3958 4.0152 2.2242 1.1913 5.7595 0.6888 4.1038 0.3410 7.5690 25.2263 3.5930 6.3947 1.7975 0.2293 10.5988 5.7811 19.5573 27.0946 9.1338 12.8296 30.3316 26.0714 19.1091 0.5234 9.7339 1.9383 1.2409 21.8521 82.1975 50.8528 85.0344 7.7465 13.8778 9.2556 18.8413 1.7708 5.4880 19.1956 86.8269 6.1801 4.6295 3.1810 42.1889 5.1185 3.4733 3.2568 21.2489 10.3792 13.9380 2.6431 136.3565 63.9490 29.5628 206.2168 4.5889 3.2260 259.7205 3.4358 64.5321 67.0878 27.4758 35.7621 25.8413 7.3094 8.6327 8.4438 268.4536 9.5594 6.4541 33.7087 3.0349 9.5097 57.0976 183.8358 11.0312 69.9471 44.6511 20.0163 11.1692 255.2273 20.6622 18.4884 9.8322 30.0080 27.2137 21.5116 52.2526 411.9109 5.7252 2.6673 156.1686 175.0828 65.1297 96.9886 250.2564 501.3360 47.3292 12.9355 24.5929 51.1885 5.3038 32.7207 9.1704 9.8123 4.7259 3.1077 0.7737 0.5382 1.5847 80.9089 33.8494
temp: 298.150 k
press: 1.00000 atm
elementType: 17 17 16 16 16 8 8 8 8 8 7 7 7 7 7 6 6 6 6 6 6 6 6 6 6 6 6 6 6 6 6 6 6 1 1 1 1 1 1 1 1 1 1 1 1 1 1 1
symmnumber: 1
zpe: 835470.7 jmol-1
zpe.correction: 0.318214 hartree
zpe.thermalcorrener: 0.351107 hartree
zpe.thermalcorrenthalpy: 0.352051 hartree
zpe.thermalcorrgfe: 0.244790 hartree
zpe.sumelectzpe: -3456.642586 hartree
zpe.sumelectthermal: -3456.609693 hartree
zpe.sumelectthermalent: -3456.608749 hartree
zpe.sumelectthermalfe: -3456.716010 hartree
dipole: 10.3092 -1.9758 3.1221
dipole: 10.9513
quadrupole: -286.8527 -225.1205 -219.5878
quadrupole: 41.3062 -29.3471 18.3748
quadrupole: -42.9990 18.7331 24.2659 41.3062 -29.3471 18.3748
hfenergy: -3456.9608004 hartree
pointgroup: C01 [X(C18H15Cl2N5O5S3)]
dipole: -3.689079 -1.7181737 -1.4149957 debye
polarizability: 420.2776527|-35.8878494|388.0910757|51.7711007|22.5544754|210.5881753 unknown
charge 0 multiplicity 1
48 atoms
Cl 8.121525 1.624555 1.180258
Cl 3.718508 4.985309 0.209477
S  -0.592937 0.028607 0.754711
S  -5.340382 -1.514378 -0.505454
S  -6.820202 1.06351 -1.510346
O  0.234174 -3.826878 -1.418599
O  -1.854486 -5.167228 0.303298
O  4.074634 -1.567309 0.381289
O  -3.957893 -4.293913 -0.160164
O  6.505604 4.24828 1.313146
N  -0.744444 -2.73688 0.548921
N  1.967036 -1.205501 -0.553903
N  4.600195 1.150161 -0.771236
N  -5.063669 1.078345 0.50202
N  -5.492017 2.41776 0.375175
C  0.085884 -1.686517 1.180047
C  1.292459 -2.166455 0.291773
C  0.248486 -3.109321 -0.410485
C  -2.152918 -2.820957 0.59974
C  -2.908594 -1.737883 1.01346
C  -2.317519 -0.397803 1.419044
C  -4.406242 -1.809335 1.163649
C  3.330702 -0.981079 -0.454453
C  -2.767362 -4.121093 0.203023
C  3.909683 0.039376 -1.459919
C  5.854295 0.942143 -0.201346
C  3.971229 2.383555 -0.617202
C  -5.640686 0.254275 -0.375788
C  6.491661 1.955581 0.484155
C  4.587326 3.410346 0.066879
C  5.925712 3.307078 0.691023
C  -6.376324 2.61063 -0.595756
C  -6.980133 3.933374 -0.950323
H  0.188912 -1.780395 2.270787
H  2.061829 -2.70471 0.870371
H  -2.267127 -0.327963 2.522281
H  -2.989194 0.41206 1.077142
H  1.405906 -0.683716 -1.231416
H  -4.782036 -1.028307 1.842265
H  -4.772977 -2.802026 1.456798
H  3.135966 0.461866 -2.12283
H  4.639017 -0.498504 -2.091477
H  -2.266966 -6.004803 -0.0404
H  6.280121 -0.056768 -0.306546
H  2.982426 2.497038 -1.066891
H  -6.571909 4.701736 -0.274402
H  -8.079568 3.917536 -0.843774
H  -6.746605 4.219099 -1.991622
