program: Orca
programVersion: 5.0.2
elementType: O O O C C C C C C C C C C C C C C C C C C C H H H H H H H H H H H H H H H H H H H H H H H H
charge: 0
multiplicity: 1
keywords: wb97x-d3
keywords: def2-TZVPP
keywords: def2/J RIJCOSX
keywords: DEFGRID2
keywords: scfconv7
keywords: smallprint printgap noloewdin
keywords: NOSOSCF
formula: C19H24O3
InChI: InChI=1/C19H24O3/c1-7-8-13-12(4)16(10-15(13)20)22-18(21)17-14(9-11(2)3)19(17,5)6/h1,9,14,16-17H,8,10H2,2-6H3
46 atoms
O  0.397374 -1.512575 -0.188116
O  0.095528 0.685698 -0.484136
O  4.200778 0.36157 -2.334114
C  -2.576586 0.031207 1.049975
C  -2.843392 0.249734 -0.407565
C  -1.773247 -0.726921 0.002898
C  -1.94434 1.140938 1.853581
C  -3.550227 -0.80151 1.846542
C  -4.070905 -0.249652 -1.079245
C  -0.354149 -0.406502 -0.255655
C  -5.235392 0.399379 -1.110144
C  1.805984 -1.405853 -0.368458
C  -6.420098 -0.153347 -1.841958
C  -5.453422 1.720458 -0.43826
C  2.284568 -1.021214 -1.765784
C  2.488664 -0.433262 0.562802
C  3.440389 0.259592 -0.071876
C  3.43279 -0.062164 -1.508937
C  2.128986 -0.381841 2.003078
C  4.405945 1.257807 0.495145
C  5.267245 0.706882 1.53342
C  5.968129 0.250731 2.394326
H  -2.448075 1.184538 -0.797215
H  -2.017063 -1.781132 -0.076439
H  -2.725702 1.772176 2.281661
H  -1.291529 1.777815 1.261512
H  -1.362901 0.738958 2.686496
H  -3.986616 -1.608204 1.259305
H  -4.373882 -0.183331 2.209042
H  -3.05788 -1.243605 2.714587
H  -3.996272 -1.201808 -1.596666
H  2.152766 -2.412513 -0.117706
H  1.516083 -0.500529 -2.338371
H  2.613041 -1.873415 -2.360745
H  -7.270301 -0.288416 -1.168726
H  -6.750869 0.531677 -2.626531
H  -6.203564 -1.11429 -2.306828
H  -4.584492 2.05959 0.122415
H  -5.700785 2.492218 -1.171703
H  -6.298514 1.669441 0.252678
H  2.916691 0.069816 2.602372
H  1.927618 -1.378473 2.398373
H  1.220718 0.208696 2.145111
H  5.02579 1.641687 -0.318904
H  3.862143 2.117907 0.896638
H  6.598894 -0.152124 3.148986
totalener: -964.14602253 hartree
nucrepener: 1773.15984305 hartree
electener: -2737.30586558 hartree
oneelecener: -4831.00080228 hartree
twoeener: 2093.69493670 hartree
kineticenergy: 959.82816527 hartree
xcener: -94.701173199561 hartree
chargesum: -0.0000000
charge: -0.272500 -0.381528 -0.334275 0.099215 -0.036026 -0.094515 -0.297558 -0.243612 -0.189003 0.308772 -0.028500 0.249184 -0.210924 -0.235460 -0.150795 -0.005234 -0.076547 0.218340 -0.264044 -0.170169 -0.416877 0.092696 0.111161 0.079673 0.091939 0.110386 0.083159 0.083750 0.087412 0.094338 0.089957 0.097835 0.101384 0.090991 0.084432 0.087125 0.079749 0.080577 0.097634 0.086008 0.105999 0.099638 0.109855 0.118202 0.123787 0.244368
qa: -0.2725 -0.3815 -0.3343 0.0992 -0.0360 -0.0945 -0.2976 -0.2436 -0.1890 0.3088 -0.0285 0.2492 -0.2109 -0.2355 -0.1508 -0.0052 -0.0765 0.2183 -0.2640 -0.1702 -0.4169 0.0927 0.1112 0.0797 0.0919 0.1104 0.0832 0.0838 0.0874 0.0943 0.0900 0.0978 0.1014 0.0910 0.0844 0.0871 0.0797 0.0806 0.0976 0.0860 0.1060 0.0996 0.1099 0.1182 0.1238 0.2444
va: 2.1297 2.1157 2.1687 3.6821 3.8253 3.8751 3.9012 3.9064 3.8518 4.2743 3.7454 3.8112 3.9399 3.9379 3.8552 3.6273 3.5294 4.1186 3.9431 3.9048 3.8789 3.5666 1.0239 1.0373 1.0065 1.0161 1.0032 1.0074 1.0031 1.0052 1.0133 0.9914 1.0293 1.0265 0.9991 0.9981 1.0105 1.0114 1.0021 1.0004 1.0135 1.0040 1.0002 1.0187 0.9840 0.9735
dispcorr: -0.022999629 hartree
energy: -964.169022156846
dipole: -32.39154 30.72940 -1.66213 2.39362 -3.11017 -0.71655 8.80537 -7.63318 1.17219
magnitude: 2.15642 au
magnitude: 5.48119 debye
