program: Orca
programVersion: 5.0.2
elementType: O O O C C C C C C C C C C C C C C C C C C C H H H H H H H H H H H H H H H H H H H H H H H H
charge: 0
multiplicity: 1
keywords: wb97x-d3
keywords: def2-TZVPP
keywords: def2/J RIJCOSX
keywords: DEFGRID2
keywords: scfconv7
keywords: smallprint printgap noloewdin
keywords: NOSOSCF
formula: C19H24O3
InChI: InChI=1/C19H24O3/c1-7-8-13-12(4)16(10-15(13)20)22-18(21)17-14(9-11(2)3)19(17,5)6/h1,9,14,16-17H,8,10H2,2-6H3
46 atoms
O  0.483717 -1.084794 -0.139044
O  -0.695538 -1.032004 1.76826
O  5.03717 -1.563323 -0.724693
C  -3.109584 -1.641227 -0.136001
C  -3.059425 -0.179615 0.177458
C  -1.812406 -0.88133 -0.341062
C  -3.260833 -2.613404 1.009195
C  -3.793697 -2.117537 -1.396701
C  -3.713069 0.854665 -0.642856
C  -0.654191 -1.0104 0.565426
C  -4.129839 2.055104 -0.231837
C  1.724987 -1.167737 0.560153
C  -4.790867 3.003523 -1.1877
C  -3.995981 2.580247 1.16592
C  2.707516 -2.038548 -0.211897
C  2.383147 0.189765 0.634534
C  3.63582 0.156542 0.164653
C  3.964761 -1.195433 -0.320023
C  1.660136 1.35587 1.200762
C  4.631124 1.276611 0.101641
C  4.197014 2.361613 -0.768631
C  3.824324 3.251644 -1.481703
H  -3.009066 0.029095 1.240077
H  -1.549362 -0.693869 -1.375932
H  -2.795774 -3.571708 0.769618
H  -4.320958 -2.7993 1.190352
H  -2.822709 -2.251245 1.93532
H  -3.450376 -3.119937 -1.656999
H  -3.601901 -1.478277 -2.257459
H  -4.874465 -2.163266 -1.2523
H  -3.863903 0.610687 -1.689935
H  1.550874 -1.549235 1.569638
H  2.335029 -2.251071 -1.216228
H  2.915827 -2.995353 0.266858
H  -4.228857 3.937531 -1.266308
H  -4.882711 2.583021 -2.188341
H  -5.793118 3.272479 -0.844619
H  -4.979267 2.772656 1.601909
H  -3.460867 1.914238 1.838326
H  -3.467492 3.536423 1.164385
H  0.854018 1.665814 0.531886
H  2.312164 2.215661 1.33856
H  1.198821 1.101593 2.155819
H  4.822621 1.671381 1.103916
H  5.583749 0.880037 -0.258221
H  3.499818 4.036632 -2.120839
totalener: -964.15036295 hartree
nucrepener: 1752.98204293 hartree
electener: -2717.13240588 hartree
oneelecener: -4790.48586388 hartree
twoeener: 2073.35345800 hartree
kineticenergy: 959.82127519 hartree
xcener: -94.698987566586 hartree
chargesum: -0.0000000
charge: -0.275798 -0.394781 -0.329284 0.086649 0.022134 -0.074450 -0.254281 -0.263592 -0.185676 0.322382 -0.043261 0.222060 -0.204165 -0.242458 -0.134980 -0.045793 -0.059786 0.219155 -0.241961 -0.158821 -0.416798 0.094364 0.094665 0.075691 0.084289 0.086612 0.099448 0.090835 0.074750 0.097924 0.073265 0.097834 0.091152 0.088055 0.084414 0.076608 0.084319 0.089706 0.084988 0.084005 0.104377 0.094497 0.119823 0.118744 0.118370 0.244766
qa: -0.2758 -0.3948 -0.3293 0.0866 0.0221 -0.0745 -0.2543 -0.2636 -0.1857 0.3224 -0.0433 0.2221 -0.2042 -0.2425 -0.1350 -0.0458 -0.0598 0.2192 -0.2420 -0.1588 -0.4168 0.0944 0.0947 0.0757 0.0843 0.0866 0.0994 0.0908 0.0748 0.0979 0.0733 0.0978 0.0912 0.0881 0.0844 0.0766 0.0843 0.0897 0.0850 0.0840 0.1044 0.0945 0.1198 0.1187 0.1184 0.2448
va: 2.1213 2.1048 2.1735 3.7563 3.8050 3.8323 3.9109 3.9191 3.9203 4.2499 3.8189 3.7692 3.9354 3.9437 3.8749 3.7179 3.4869 4.1094 3.9476 3.9154 3.8631 3.5736 1.0271 1.0374 1.0027 1.0009 1.0219 1.0046 1.0099 1.0017 1.0217 1.0303 1.0318 1.0278 0.9987 1.0123 0.9978 0.9986 1.0160 0.9994 1.0016 1.0048 1.0085 0.9854 1.0202 0.9733
dispcorr: -0.020932104 hartree
energy: -964.171295057195
dipole: -30.11047 28.65139 -1.45908 6.88506 -6.35506 0.53000 0.45347 -0.33882 0.11464
magnitude: 1.55659 au
magnitude: 3.95654 debye
