program: Orca
programVersion: 5.0.2
elementType: O O O C C C C C C C C C C C C C C C C C C C H H H H H H H H H H H H H H H H H H H H H H H H
charge: 0
multiplicity: 1
keywords: wb97x-d3
keywords: def2-TZVPP
keywords: def2/J RIJCOSX
keywords: DEFGRID2
keywords: scfconv7
keywords: smallprint printgap noloewdin
keywords: NOSOSCF
formula: C19H24O3
InChI: InChI=1/C19H24O3/c1-7-8-13-12(4)16(10-15(13)20)22-18(21)17-14(9-11(2)3)19(17,5)6/h1,9,14,16-17H,8,10H2,2-6H3
46 atoms
O  0.454769 -1.110696 -0.139347
O  -0.723826 -1.084812 1.768885
O  5.012816 -1.504429 -0.735789
C  -3.140008 -1.692872 -0.130985
C  -3.091618 -0.234051 0.186687
C  -1.843509 -0.932559 -0.338635
C  -3.285609 -2.671223 1.009863
C  -3.824759 -2.165296 -1.392813
C  -3.752233 0.806625 -0.622478
C  -0.683788 -1.056484 0.565912
C  -3.97896 2.069454 -0.251708
C  1.697335 -1.174527 0.559335
C  -4.680978 3.025421 -1.169376
C  -3.57405 2.65705 1.066425
C  2.694486 -2.025079 -0.216387
C  2.331059 0.194441 0.637635
C  3.582498 0.186422 0.163354
C  3.934788 -1.157604 -0.327474
C  1.588255 1.344347 1.211761
C  4.557197 1.324559 0.101326
C  4.093538 2.41424 -0.747687
C  3.697477 3.312855 -1.437028
H  -3.035684 -0.029895 1.250142
H  -1.584309 -0.740075 -1.373377
H  -2.821117 -3.627933 0.762913
H  -4.344712 -2.85857 1.195542
H  -2.842922 -2.313708 1.935651
H  -3.63738 -1.520052 -2.250255
H  -4.905012 -2.218181 -1.246229
H  -3.476888 -3.164317 -1.659729
H  -4.082247 0.513106 -1.613984
H  1.530325 -1.562645 1.567484
H  2.324003 -2.244106 -1.220048
H  2.922441 -2.978106 0.261051
H  -5.587498 3.421836 -0.704879
H  -4.048434 3.88626 -1.400142
H  -4.966177 2.557714 -2.110911
H  -3.010465 1.973706 1.697313
H  -2.954702 3.544029 0.91235
H  -4.450417 2.987282 1.629788
H  1.131684 1.075434 2.165072
H  0.777037 1.645197 0.544822
H  2.225498 2.214123 1.355666
H  4.756631 1.708658 1.106272
H  5.511294 0.949286 -0.277027
H  3.34735 4.100701 -2.058791
totalener: -964.15005309 hartree
nucrepener: 1758.49149710 hartree
electener: -2722.64155019 hartree
oneelecener: -4801.49880258 hartree
twoeener: 2078.85725239 hartree
kineticenergy: 959.82091319 hartree
xcener: -94.698849495385 hartree
chargesum: -0.0000000
charge: -0.276035 -0.396115 -0.329312 0.097625 -0.005791 -0.060218 -0.254028 -0.271709 -0.183051 0.317732 -0.030872 0.220905 -0.208863 -0.247427 -0.135904 -0.042628 -0.061285 0.219571 -0.243484 -0.158498 -0.417911 0.095202 0.097028 0.078079 0.084354 0.086363 0.100158 0.074325 0.099741 0.091513 0.077373 0.098396 0.091283 0.088318 0.084745 0.084545 0.077155 0.083674 0.083956 0.090565 0.119800 0.103646 0.094955 0.118718 0.118560 0.244848
qa: -0.2760 -0.3961 -0.3293 0.0976 -0.0058 -0.0602 -0.2540 -0.2717 -0.1831 0.3177 -0.0309 0.2209 -0.2089 -0.2474 -0.1359 -0.0426 -0.0613 0.2196 -0.2435 -0.1585 -0.4179 0.0952 0.0970 0.0781 0.0844 0.0864 0.1002 0.0743 0.0997 0.0915 0.0774 0.0984 0.0913 0.0883 0.0847 0.0845 0.0772 0.0837 0.0840 0.0906 0.1198 0.1036 0.0950 0.1187 0.1186 0.2448
va: 2.1215 2.1023 2.1735 3.7784 3.8198 3.8220 3.9056 3.9192 3.9237 4.2463 3.7984 3.7730 3.9393 3.9460 3.8757 3.7109 3.4904 4.1091 3.9483 3.9146 3.8640 3.5718 1.0248 1.0365 1.0027 1.0011 1.0216 1.0087 1.0009 1.0048 1.0197 1.0300 1.0318 1.0278 0.9976 0.9986 1.0119 1.0158 0.9992 0.9992 1.0086 1.0012 1.0049 0.9855 1.0201 0.9732
dispcorr: -0.021129589 hartree
energy: -964.171182677916
dipole: -29.23910 27.80391 -1.43519 6.89224 -6.36988 0.52236 0.36493 -0.25684 0.10809
magnitude: 1.53112 au
magnitude: 3.89179 debye
