program: Orca
programVersion: 5.0.2
elementType: O O O C C C C C C C C C C C C C C C C C C C H H H H H H H H H H H H H H H H H H H H H H H H
charge: 0
multiplicity: 1
keywords: wb97x-d3
keywords: def2-TZVPP
keywords: def2/J RIJCOSX
keywords: DEFGRID2
keywords: scfconv7
keywords: smallprint printgap noloewdin
keywords: NOSOSCF
formula: C19H24O3
InChI: InChI=1/C19H24O3/c1-7-8-13-12(4)16(10-15(13)20)22-18(21)17-14(9-11(2)3)19(17,5)6/h1,9,14,16-17H,8,10H2,2-6H3
46 atoms
O  0.579356 -0.543017 -0.001527
O  -0.702017 -0.867518 1.812481
O  4.96074 -2.027528 -0.355328
C  -2.93384 -1.214342 -0.368178
C  -3.03678 0.130501 0.282288
C  -1.710575 -0.3132 -0.282287
C  -3.041932 -2.453414 0.485549
C  -3.520474 -1.388766 -1.747836
C  -3.763871 1.262658 -0.346408
C  -0.596409 -0.607428 0.643496
C  -5.060873 1.518424 -0.171524
C  1.780798 -0.806253 0.720018
C  -5.722065 2.696949 -0.818282
C  -5.954976 0.669734 0.679452
C  2.571786 -1.952779 0.101137
C  2.693079 0.390042 0.627903
C  3.920041 0.046579 0.219635
C  3.976746 -1.400403 -0.058975
C  2.198179 1.73649 1.007259
C  5.124274 0.925072 0.054823
C  4.927949 1.974659 -0.93672
C  4.754903 2.842818 -1.746683
H  -3.075242 0.097848 1.367849
H  -1.406448 0.130413 -1.224498
H  -2.476202 -3.2796 0.050189
H  -4.086256 -2.767693 0.539795
H  -2.687744 -2.302471 1.502118
H  -3.396163 -0.504321 -2.371042
H  -4.591552 -1.589433 -1.681018
H  -3.054309 -2.231356 -2.261317
H  -3.186895 1.929987 -0.980043
H  1.538891 -1.004481 1.767391
H  2.177752 -2.207198 -0.885298
H  2.569556 -2.864212 0.698752
H  -5.027231 3.275627 -1.425586
H  -6.547556 2.380089 -1.460504
H  -6.1509 3.367123 -0.069053
H  -5.455383 -0.214466 1.070724
H  -6.340665 1.240886 1.527757
H  -6.826198 0.336066 0.110587
H  2.998325 2.470542 1.06901
H  1.677546 1.701237 1.96628
H  1.478781 2.096818 0.269309
H  5.394154 1.380264 1.012498
H  5.974189 0.302987 -0.236641
H  4.606949 3.604955 -2.472863
totalener: -964.14952150 hartree
nucrepener: 1736.24161397 hartree
electener: -2700.39113546 hartree
oneelecener: -4757.03117436 hartree
twoeener: 2056.64003890 hartree
kineticenergy: 959.82372222 hartree
xcener: -94.697505487129 hartree
chargesum: -0.0000000
charge: -0.283368 -0.386907 -0.328536 0.093661 -0.030898 -0.120570 -0.273511 -0.240575 -0.185823 0.349626 -0.030348 0.207142 -0.210428 -0.234466 -0.139750 -0.024610 -0.057634 0.225893 -0.258428 -0.161226 -0.416744 0.095559 0.107725 0.080525 0.089781 0.084896 0.105206 0.081668 0.088143 0.094223 0.088618 0.103046 0.088564 0.091146 0.078521 0.084519 0.087089 0.080189 0.096701 0.085105 0.094628 0.111254 0.106867 0.118880 0.120152 0.244493
qa: -0.2834 -0.3869 -0.3285 0.0937 -0.0309 -0.1206 -0.2735 -0.2406 -0.1858 0.3496 -0.0303 0.2071 -0.2104 -0.2345 -0.1398 -0.0246 -0.0576 0.2259 -0.2584 -0.1612 -0.4167 0.0956 0.1077 0.0805 0.0898 0.0849 0.1052 0.0817 0.0881 0.0942 0.0886 0.1030 0.0886 0.0911 0.0785 0.0845 0.0871 0.0802 0.0967 0.0851 0.0946 0.1113 0.1069 0.1189 0.1202 0.2445
va: 2.1157 2.1211 2.1740 3.7177 3.8105 3.8844 3.9075 3.9066 3.8531 4.2406 3.7425 3.7705 3.9401 3.9398 3.8839 3.6696 3.5019 4.1128 3.9521 3.9133 3.8643 3.5724 1.0248 1.0370 1.0030 1.0020 1.0195 1.0073 1.0036 1.0055 1.0139 1.0360 1.0305 1.0277 1.0107 0.9991 0.9978 1.0111 1.0013 1.0005 1.0062 1.0039 1.0033 0.9854 1.0194 0.9734
dispcorr: -0.021427985 hartree
energy: -964.170949483561
dipole: -33.63650 32.15953 -1.47697 5.03416 -4.20719 0.82697 -2.05895 1.99848 -0.06047
magnitude: 1.69381 au
magnitude: 4.30532 debye
