program: Orca
programVersion: 5.0.2
elementType: O O O C C C C C C C C C C C C C C C C C C C H H H H H H H H H H H H H H H H H H H H H H H H
charge: 0
multiplicity: 1
keywords: wb97x-d3
keywords: def2-TZVPP
keywords: def2/J RIJCOSX
keywords: DEFGRID2
keywords: scfconv7
keywords: smallprint printgap noloewdin
keywords: NOSOSCF
formula: C19H24O3
InChI: InChI=1/C19H24O3/c1-7-8-13-12(4)16(10-15(13)20)22-18(21)17-14(9-11(2)3)19(17,5)6/h1,9,14,16-17H,8,10H2,2-6H3
46 atoms
O  0.206927 -0.975311 -0.272844
O  -0.352399 -2.772317 0.943771
O  4.092069 0.159058 -2.410672
C  -2.230234 0.296439 1.141221
C  -2.487183 0.007258 -0.30798
C  -1.982585 -1.096938 0.585322
C  -1.085237 1.204034 1.520266
C  -3.413896 0.426639 2.068552
C  -3.859802 -0.071253 -0.871239
C  -0.643125 -1.713618 0.454178
C  -4.541756 0.971865 -1.346111
C  1.540194 -1.444201 -0.476446
C  -5.912529 0.812218 -1.929894
C  -4.003295 2.370403 -1.346001
C  2.034455 -1.010597 -1.85132
C  2.487177 -0.792289 0.503444
C  3.479561 -0.14779 -0.121894
C  3.325086 -0.259541 -1.582687
C  2.279641 -0.919304 1.967852
C  4.622223 0.605665 0.490439
C  4.180307 1.763458 1.25707
C  3.802277 2.709382 1.890867
H  -1.740104 0.414882 -0.982292
H  -2.714845 -1.833243 0.899487
H  -0.267338 1.190314 0.804225
H  -0.683753 0.938433 2.500831
H  -1.442204 2.233632 1.588602
H  -3.118727 0.225613 3.099874
H  -4.223048 -0.255627 1.812169
H  -3.81943 1.439438 2.027795
H  -4.322923 -1.053089 -0.907493
H  1.564837 -2.530081 -0.354532
H  1.321384 -0.342539 -2.338066
H  2.207124 -1.845524 -2.530889
H  -6.25025 -0.223089 -1.906352
H  -6.643168 1.417735 -1.387878
H  -5.938908 1.149763 -2.968888
H  -3.037085 2.453522 -0.852102
H  -3.892699 2.744965 -2.366845
H  -4.694434 3.049915 -0.841355
H  2.050242 -1.949452 2.24158
H  1.431593 -0.310559 2.288759
H  3.146032 -0.584065 2.534266
H  5.20882 -0.053186 1.137602
H  5.295477 0.931534 -0.306282
H  3.474614 3.555225 2.445077
totalener: -964.14647638 hartree
nucrepener: 1789.54185759 hartree
electener: -2753.68833397 hartree
oneelecener: -4863.45040324 hartree
twoeener: 2109.76206927 hartree
kineticenergy: 959.82505248 hartree
xcener: -94.698172517573 hartree
chargesum: 0.0000000
charge: -0.273064 -0.363311 -0.328531 0.126249 0.003956 -0.123582 -0.327101 -0.243016 -0.219205 0.334393 -0.021182 0.177188 -0.211299 -0.237748 -0.131858 -0.048768 -0.056782 0.219013 -0.240370 -0.155095 -0.409045 0.084383 0.105019 0.083798 0.100597 0.097529 0.092773 0.095969 0.083260 0.085927 0.092608 0.104411 0.090937 0.090095 0.079964 0.085107 0.086694 0.079651 0.097447 0.086127 0.122800 0.106008 0.096032 0.118293 0.118852 0.244877
qa: -0.2731 -0.3633 -0.3285 0.1262 0.0040 -0.1236 -0.3271 -0.2430 -0.2192 0.3344 -0.0212 0.1772 -0.2113 -0.2377 -0.1319 -0.0488 -0.0568 0.2190 -0.2404 -0.1551 -0.4090 0.0844 0.1050 0.0838 0.1006 0.0975 0.0928 0.0960 0.0833 0.0859 0.0926 0.1044 0.0909 0.0901 0.0800 0.0851 0.0867 0.0797 0.0974 0.0861 0.1228 0.1060 0.0960 0.1183 0.1189 0.2449
va: 2.0804 2.1385 2.1749 3.6377 3.7808 3.9222 3.9108 3.9107 3.8597 4.2734 3.7376 3.7912 3.9417 3.9422 3.8779 3.6759 3.4708 4.1128 3.9529 3.9160 3.8620 3.5868 1.0163 1.0325 1.0122 0.9975 1.0084 1.0047 1.0078 1.0031 1.0147 1.0290 1.0301 1.0276 1.0107 0.9989 0.9979 1.0102 1.0016 1.0007 1.0108 0.9985 1.0037 0.9856 1.0196 0.9734
dispcorr: -0.023484153 hartree
energy: -964.169960529316
dipole: -25.87428 24.76936 -1.10492 10.19466 -9.80585 0.38881 5.08142 -4.44231 0.63911
magnitude: 1.33434 au
magnitude: 3.39163 debye
