program: Orca
programVersion: 5.0.2
elementType: O O O C C C C C C C C C C C C C C C C C C C H H H H H H H H H H H H H H H H H H H H H H H H
charge: 0
multiplicity: 1
keywords: wb97x-d3
keywords: def2-TZVPP
keywords: def2/J RIJCOSX
keywords: DEFGRID2
keywords: scfconv7
keywords: smallprint printgap noloewdin
keywords: NOSOSCF
formula: C19H24O3
InChI: InChI=1/C19H24O3/c1-7-8-13-12(4)16(10-15(13)20)22-18(21)17-14(9-11(2)3)19(17,5)6/h1,9,14,16-17H,8,10H2,2-6H3
46 atoms
O  0.173708 -0.897971 -0.288145
O  -0.361381 -2.783584 0.797259
O  4.027945 0.348311 -2.431225
C  -2.231959 0.233177 1.324988
C  -2.524242 0.105425 -0.14258
C  -1.996302 -1.088441 0.61579
C  -1.077351 1.101469 1.762335
C  -3.384591 0.259999 2.299781
C  -3.905217 0.073212 -0.674013
C  -0.660789 -1.689608 0.399264
C  -4.466917 0.995677 -1.457714
C  1.498345 -1.359004 -0.559971
C  -5.875517 0.841012 -1.947773
C  -3.778024 2.24527 -1.915152
C  1.964032 -0.827899 -1.910075
C  2.474092 -0.790876 0.443092
C  3.457413 -0.108506 -0.155823
C  3.271972 -0.116264 -1.617578
C  2.300627 -1.031364 1.897644
C  4.617385 0.592612 0.486243
C  4.192238 1.651169 1.392674
C  3.822236 2.510348 2.144124
H  -1.79417 0.589884 -0.781389
H  -2.722004 -1.856061 0.863533
H  -0.647667 0.737362 2.698421
H  -1.432681 2.117214 1.944507
H  -0.279837 1.163994 1.025875
H  -4.201909 -0.39617 2.004397
H  -3.79119 1.269523 2.380295
H  -3.054559 -0.048516 3.293169
H  -4.507368 -0.787712 -0.397797
H  1.515844 -2.451019 -0.520794
H  1.248919 -0.115345 -2.325556
H  2.107724 -1.610612 -2.655283
H  -6.338776 -0.075649 -1.585264
H  -6.496803 1.681277 -1.627949
H  -5.912367 0.825649 -3.039836
H  -2.765388 2.349617 -1.532414
H  -3.730136 2.285931 -3.006074
H  -4.33884 3.127786 -1.597733
H  3.184563 -0.753702 2.46769
H  2.063231 -2.077453 2.092502
H  1.468679 -0.440555 2.287061
H  5.239023 -0.122951 1.032941
H  5.252743 1.012751 -0.297317
H  3.503253 3.281006 2.803072
totalener: -964.14701851 hartree
nucrepener: 1786.21677980 hartree
electener: -2750.36379831 hartree
oneelecener: -4856.77325766 hartree
twoeener: 2106.40945935 hartree
kineticenergy: 959.82407146 hartree
xcener: -94.698694544935 hartree
chargesum: 0.0000000
charge: -0.274698 -0.363430 -0.328750 0.148022 0.056046 -0.144179 -0.319277 -0.236085 -0.221864 0.337287 -0.029020 0.177166 -0.209239 -0.240362 -0.131839 -0.044361 -0.060142 0.219077 -0.241935 -0.155076 -0.408106 0.082584 0.088165 0.078134 0.094063 0.094791 0.095753 0.074876 0.088326 0.093262 0.080988 0.104352 0.090554 0.090144 0.078340 0.084180 0.086435 0.080398 0.089957 0.086345 0.096565 0.123552 0.105908 0.118843 0.119503 0.244746
qa: -0.2747 -0.3634 -0.3287 0.1480 0.0560 -0.1442 -0.3193 -0.2361 -0.2219 0.3373 -0.0290 0.1772 -0.2092 -0.2404 -0.1318 -0.0444 -0.0601 0.2191 -0.2419 -0.1551 -0.4081 0.0826 0.0882 0.0781 0.0941 0.0948 0.0958 0.0749 0.0883 0.0933 0.0810 0.1044 0.0906 0.0901 0.0783 0.0842 0.0864 0.0804 0.0900 0.0863 0.0966 0.1236 0.1059 0.1188 0.1195 0.2447
va: 2.0862 2.1371 2.1747 3.6521 3.7333 3.9472 3.9164 3.9121 3.9036 4.2592 3.7767 3.7906 3.9401 3.9513 3.8783 3.6696 3.4726 4.1103 3.9529 3.9171 3.8589 3.5890 1.0223 1.0375 0.9966 1.0082 1.0131 1.0105 1.0058 1.0040 1.0181 1.0292 1.0299 1.0279 1.0117 0.9986 0.9981 1.0122 0.9993 1.0002 1.0036 1.0111 0.9983 0.9857 1.0197 0.9735
dispcorr: -0.022823065 hartree
energy: -964.169841574265
dipole: -25.27541 24.21706 -1.05835 9.08213 -8.75636 0.32577 4.89556 -4.23078 0.66478
magnitude: 1.29158 au
magnitude: 3.28293 debye
