program: Orca
programVersion: 5.0.2
elementType: O O O C C C C C C C C C C C C C C C C C C C H H H H H H H H H H H H H H H H H H H H H H H H
charge: 0
multiplicity: 1
keywords: wb97x-d3
keywords: def2-TZVPP
keywords: def2/J RIJCOSX
keywords: DEFGRID2
keywords: scfconv7
keywords: smallprint printgap noloewdin
keywords: NOSOSCF
formula: C19H24O3
InChI: InChI=1/C19H24O3/c1-7-8-13-12(4)16(10-15(13)20)22-18(21)17-14(9-11(2)3)19(17,5)6/h1,9,14,16-17H,8,10H2,2-6H3
46 atoms
O  0.320765 -1.033491 -0.080881
O  -0.759655 -1.207422 1.874875
O  4.809969 -1.361764 -1.042039
C  -3.240065 -1.727181 0.017927
C  -3.24245 -0.309528 0.471777
C  -1.983967 -0.883199 -0.155151
C  -3.286777 -2.831471 1.044937
C  -3.948415 -2.085153 -1.266775
C  -4.000857 0.753143 -0.239182
C  -0.782101 -1.066722 0.674853
C  -3.566826 2.001083 -0.434218
C  1.606227 -1.169103 0.5310
C  -4.395205 3.01408 -1.162882
C  -2.229189 2.488613 0.032353
C  2.543378 -1.939148 -0.388761
C  2.251914 0.184019 0.702165
C  3.466659 0.225453 0.136033
C  3.765063 -1.058389 -0.508251
C  1.567616 1.272369 1.439043
C  4.428949 1.375977 0.125253
C  3.923238 2.51342 -0.633804
C  3.491865 3.448293 -1.253893
H  -3.170926 -0.18553 1.550308
H  -1.780823 -0.577161 -1.17515
H  -2.746122 -3.714409 0.697583
H  -4.323814 -3.12936 1.212743
H  -2.87346 -2.542012 2.008341
H  -5.009836 -2.265555 -1.082898
H  -3.530051 -2.998668 -1.693885
H  -3.871016 -1.303347 -2.022649
H  -4.988198 0.485079 -0.606005
H  1.508378 -1.658021 1.502757
H  2.105631 -2.074023 -1.380939
H  2.804731 -2.927486 -0.010157
H  -4.6173 3.87388 -0.52541
H  -3.857353 3.405582 -2.030713
H  -5.341135 2.600327 -1.512385
H  -1.566079 2.671412 -0.818003
H  -2.328152 3.44273 0.555691
H  -1.728815 1.79383 0.704402
H  1.146959 0.905091 2.376084
H  0.735181 1.668378 0.850668
H  2.234547 2.102922 1.662783
H  4.647117 1.697056 1.147686
H  5.381698 1.053689 -0.301473
H  3.108657 4.281771 -1.798409
elementType: O C H
totalener: -964.17211818 hartree
nucrepener: 1782.27437506 hartree
electener: -2746.44649325 hartree
oneelecener: -4849.10432167 hartree
twoeener: 2102.65782842 hartree
cpcmener: -0.03009320 hartree
kineticenergy: 959.76176589 hartree
xcener: -94.694038967062 hartree
chargesum: -0.0000000
charge: -0.288962 -0.470082 -0.445060 0.147194 -0.009352 -0.106431 -0.282300 -0.285822 -0.303338 0.371080 -0.006695 0.243461 -0.227485 -0.235649 -0.131537 -0.008242 -0.090858 0.284148 -0.274408 -0.099829 -0.459784 0.043542 0.104422 0.092604 0.099466 0.094796 0.093187 0.098534 0.097191 0.093279 0.120960 0.104474 0.101329 0.099510 0.096184 0.094289 0.088970 0.104638 0.101420 0.071755 0.120306 0.119428 0.107829 0.133193 0.110635 0.288014
qa: -0.2890 -0.4701 -0.4451 0.1472 -0.0094 -0.1064 -0.2823 -0.2858 -0.3033 0.3711 -0.0067 0.2435 -0.2275 -0.2356 -0.1315 -0.0082 -0.0909 0.2841 -0.2744 -0.0998 -0.4598 0.0435 0.1044 0.0926 0.0995 0.0948 0.0932 0.0985 0.0972 0.0933 0.1210 0.1045 0.1013 0.0995 0.0962 0.0943 0.0890 0.1046 0.1014 0.0718 0.1203 0.1194 0.1078 0.1332 0.1106 0.2880
va: 2.1214 2.0318 2.0626 3.6966 3.8085 3.8112 3.8955 3.9089 3.8958 4.1777 3.7057 3.7744 3.9324 3.9331 3.9026 3.6831 3.5200 4.0565 3.9313 3.8841 3.8289 3.5363 1.0254 1.0323 0.9988 1.0012 1.0190 1.0000 1.0031 1.0018 1.0042 1.0308 1.0291 1.0242 0.9965 0.9962 1.0063 0.9961 1.0015 1.0113 1.0103 0.9943 1.0021 0.9882 1.0216 0.9465
dispcorr: -0.022677517 hartree
energy: -964.194795699198
dipole: -26.11333 24.39748 -1.71584 6.17867 -5.46380 0.71486 -0.70407 0.93030 0.22623
magnitude: 1.87252 au
magnitude: 4.75956 debye
