program: Orca
programVersion: 5.0.2
elementType: O O O C C C C C C C C C C C C C C C C C C C H H H H H H H H H H H H H H H H H H H H H H H H
charge: 0
multiplicity: 1
keywords: wb97x-d3
keywords: def2-TZVPP
keywords: def2/J RIJCOSX
keywords: DEFGRID2
keywords: scfconv7
keywords: smallprint printgap noloewdin
keywords: NOSOSCF
formula: C19H24O3
InChI: InChI=1/C19H24O3/c1-7-8-13-12(4)16(10-15(13)20)22-18(21)17-14(9-11(2)3)19(17,5)6/h1,9,14,16-17H,8,10H2,2-6H3
46 atoms
O  0.435683 -0.977198 -0.201468
O  -0.571711 -0.374109 1.707066
O  4.947221 -1.736651 -0.937367
C  -3.091316 -1.546018 0.222191
C  -3.115364 -0.048291 0.185767
C  -1.867754 -0.785484 -0.262573
C  -3.084906 -2.233722 1.565023
C  -3.841183 -2.321307 -0.83389
C  -3.893161 0.723195 -0.804508
C  -0.63674 -0.685496 0.541827
C  -4.741788 1.709872 -0.501848
C  1.738128 -0.90548 0.382117
C  -5.463248 2.46848 -1.572899
C  -5.018617 2.1446 0.912933
C  2.643337 -1.976969 -0.208479
C  2.409347 0.40332 0.040945
C  3.636417 0.204762 -0.463037
C  3.902264 -1.233139 -0.585682
C  1.744155 1.698438 0.31697
C  4.649559 1.24002 -0.854201
C  5.09638 2.046158 0.275084
C  5.451011 2.718953 1.20565
H  -3.024343 0.416491 1.162507
H  -1.699787 -0.83472 -1.332998
H  -2.651049 -1.6274 2.357041
H  -2.535628 -3.176949 1.521711
H  -4.110254 -2.466828 1.859665
H  -4.899099 -2.394094 -0.572551
H  -3.450565 -3.337718 -0.913376
H  -3.775737 -1.867661 -1.822194
H  -3.746252 0.469762 -1.850273
H  1.666958 -1.006351 1.467575
H  2.206423 -2.410929 -1.111633
H  2.855169 -2.795317 0.479627
H  -5.236591 3.537007 -1.515627
H  -5.200234 2.123388 -2.573008
H  -6.54694 2.378862 -1.458474
H  -4.177707 2.698836 1.337689
H  -5.885963 2.803465 0.959934
H  -5.215544 1.302207 1.577222
H  1.509245 1.789975 1.379957
H  0.797607 1.773489 -0.223975
H  2.358136 2.549872 0.030183
H  5.51422 0.748727 -1.306922
H  4.238261 1.898918 -1.624047
H  5.76321 3.306779 2.039548
elementType: O C H
totalener: -964.17285719 hartree
nucrepener: 1738.45984545 hartree
electener: -2702.63270264 hartree
oneelecener: -4761.53684373 hartree
twoeener: 2058.90414109 hartree
cpcmener: -0.03070051 hartree
kineticenergy: 959.75370824 hartree
xcener: -94.692706545703 hartree
chargesum: -0.0000000
charge: -0.290825 -0.467922 -0.445589 0.111571 0.053295 -0.123226 -0.280492 -0.266610 -0.307742 0.386378 -0.007372 0.256099 -0.221062 -0.284246 -0.136581 -0.034410 -0.088505 0.288329 -0.246320 -0.102637 -0.465140 0.053011 0.094524 0.086900 0.092859 0.098686 0.095408 0.097377 0.097594 0.087084 0.117348 0.104958 0.102204 0.098531 0.098195 0.084690 0.094444 0.105085 0.094907 0.101938 0.119003 0.116154 0.099538 0.110825 0.134533 0.287212
qa: -0.2908 -0.4679 -0.4456 0.1116 0.0533 -0.1232 -0.2805 -0.2666 -0.3077 0.3864 -0.0074 0.2561 -0.2211 -0.2842 -0.1366 -0.0344 -0.0885 0.2883 -0.2463 -0.1026 -0.4651 0.0530 0.0945 0.0869 0.0929 0.0987 0.0954 0.0974 0.0976 0.0871 0.1173 0.1050 0.1022 0.0985 0.0982 0.0847 0.0944 0.1051 0.0949 0.1019 0.1190 0.1162 0.0995 0.1108 0.1345 0.2872
va: 2.1272 2.0342 2.0608 3.7009 3.7472 3.8937 3.9076 3.9108 3.8957 4.1844 3.6961 3.7419 3.9227 3.9417 3.9133 3.7473 3.5192 4.0564 3.9384 3.8736 3.8289 3.5252 1.0280 1.0392 1.0192 0.9994 1.0003 1.0018 1.0025 1.0056 1.0098 1.0313 1.0278 1.0250 0.9926 1.0103 0.9940 0.9955 1.0042 0.9965 1.0030 1.0020 1.0024 1.0211 0.9878 0.9467
dispcorr: -0.020972962 hartree
energy: -964.193830155083
dipole: -32.96664 30.77172 -2.19492 5.46874 -4.77671 0.69203 -0.39292 -0.00759 -0.40051
magnitude: 2.33602 au
magnitude: 5.93768 debye
