program: Orca
programVersion: 5.0.2
elementType: O O O C C C C C C C C C C C C C C C C C C C H H H H H H H H H H H H H H H H H H H H H H H H
charge: 0
multiplicity: 1
keywords: wb97x-d3
keywords: def2-TZVPP
keywords: def2/J RIJCOSX
keywords: DEFGRID2
keywords: scfconv7
keywords: smallprint printgap noloewdin
keywords: NOSOSCF
formula: C19H24O3
InChI: InChI=1/C19H24O3/c1-7-8-13-12(4)16(10-15(13)20)22-18(21)17-14(9-11(2)3)19(17,5)6/h1,9,14,16-17H,8,10H2,2-6H3
46 atoms
O  0.424014 -1.031727 -0.207313
O  -0.577159 -0.481848 1.720477
O  4.949455 -1.667063 -0.982084
C  -3.120044 -1.595186 0.253815
C  -3.114312 -0.098578 0.19686
C  -1.882214 -0.871038 -0.247588
C  -3.122588 -2.266179 1.605529
C  -3.888069 -2.375001 -0.786481
C  -3.876748 0.678374 -0.798609
C  -0.647318 -0.77029 0.549402
C  -4.590162 1.774923 -0.524905
C  1.728775 -0.937255 0.366984
C  -5.322715 2.511717 -1.603895
C  -4.710277 2.348589 0.863269
C  2.656066 -1.976729 -0.246251
C  2.364162 0.393295 0.040889
C  3.593064 0.233156 -0.471943
C  3.893697 -1.195811 -0.618729
C  1.665537 1.665746 0.339603
C  4.580353 1.297929 -0.850337
C  4.998929 2.106258 0.288268
C  5.321196 2.776633 1.232289
H  -3.005275 0.377499 1.166218
H  -1.720228 -0.93607 -1.317946
H  -2.585305 -3.217156 1.572531
H  -4.150663 -2.483565 1.902168
H  -2.680845 -1.656471 2.390218
H  -3.808808 -1.949254 -1.785947
H  -4.947798 -2.41528 -0.525901
H  -3.522334 -3.402293 -0.839272
H  -3.838386 0.331097 -1.826697
H  1.668435 -1.055499 1.451455
H  2.223288 -2.405768 -1.153808
H  2.89219 -2.800852 0.42684
H  -6.395388 2.550459 -1.395168
H  -4.985451 3.550093 -1.667074
H  -5.186753 2.054134 -2.583979
H  -3.744767 2.671575 1.258494
H  -5.366647 3.218615 0.875502
H  -5.119769 1.627351 1.572933
H  2.257597 2.53891 0.072066
H  1.423315 1.729704 1.403757
H  0.718349 1.726194 -0.203892
H  5.459796 0.83239 -1.302569
H  4.156098 1.952495 -1.617242
H  5.613346 3.368059 2.071438
elementType: O C H
totalener: -964.17275534 hartree
nucrepener: 1741.32064679 hartree
electener: -2705.49340212 hartree
oneelecener: -4767.26192657 hartree
twoeener: 2061.76852445 hartree
cpcmener: -0.03056081 hartree
kineticenergy: 959.74830842 hartree
xcener: -94.691984808932 hartree
chargesum: 0.0000000
charge: -0.291810 -0.468720 -0.445295 0.101606 0.052172 -0.105616 -0.277219 -0.270920 -0.303631 0.382636 -0.008363 0.256866 -0.221933 -0.284538 -0.136746 -0.034606 -0.087928 0.287265 -0.247178 -0.101132 -0.462835 0.049760 0.093780 0.086513 0.098064 0.095193 0.093028 0.087477 0.097788 0.097204 0.115542 0.104967 0.102247 0.098564 0.096926 0.096869 0.084407 0.102166 0.095045 0.104692 0.100199 0.118847 0.116357 0.110689 0.134358 0.287244
qa: -0.2918 -0.4687 -0.4453 0.1016 0.0522 -0.1056 -0.2772 -0.2709 -0.3036 0.3826 -0.0084 0.2569 -0.2219 -0.2845 -0.1367 -0.0346 -0.0879 0.2873 -0.2472 -0.1011 -0.4628 0.0498 0.0938 0.0865 0.0981 0.0952 0.0930 0.0875 0.0978 0.0972 0.1155 0.1050 0.1022 0.0986 0.0969 0.0969 0.0844 0.1022 0.0950 0.1047 0.1002 0.1188 0.1164 0.1107 0.1344 0.2872
va: 2.1263 2.0333 2.0609 3.7087 3.7568 3.8736 3.9062 3.9135 3.8995 4.1862 3.6941 3.7425 3.9198 3.9400 3.9133 3.7459 3.5209 4.0565 3.9382 3.8749 3.8280 3.5276 1.0279 1.0382 0.9993 1.0001 1.0196 1.0064 1.0012 1.0020 1.0111 1.0313 1.0277 1.0250 0.9928 0.9928 1.0105 0.9968 1.0048 0.9955 1.0023 1.0033 1.0019 1.0214 0.9879 0.9467
dispcorr: -0.020948422 hartree
energy: -964.193703757495
dipole: -32.44085 30.23480 -2.20605 5.78942 -5.09787 0.69155 -0.30697 -0.08306 -0.39003
magnitude: 2.34458 au
magnitude: 5.95944 debye
