program: Orca
programVersion: 5.0.2
elementType: O O O C C C C C C C C C C C C C C C C C C C H H H H H H H H H H H H H H H H H H H H H H H H
charge: 0
multiplicity: 1
keywords: wb97x-d3
keywords: def2-TZVPP
keywords: def2/J RIJCOSX
keywords: DEFGRID2
keywords: scfconv7
keywords: smallprint printgap noloewdin
keywords: NOSOSCF
formula: C19H24O3
InChI: InChI=1/C19H24O3/c1-7-8-13-12(4)16(10-15(13)20)22-18(21)17-14(9-11(2)3)19(17,5)6/h1,9,14,16-17H,8,10H2,2-6H3
46 atoms
O  0.361155 -1.699605 -0.440336
O  0.310258 0.527533 -0.235313
O  4.282334 0.222445 -2.276399
C  -2.402258 -0.217818 1.224917
C  -2.67559 0.395316 -0.115983
C  -1.702239 -0.754363 -0.01482
C  -1.641916 0.588144 2.248274
C  -3.439906 -1.125921 1.837629
C  -3.955144 0.183014 -0.831997
C  -0.26186 -0.535701 -0.238356
C  -4.890122 1.111407 -1.052939
C  1.772327 -1.726255 -0.646773
C  -6.141801 0.780282 -1.807813
C  -4.791545 2.530733 -0.584671
C  2.276025 -1.103881 -1.94535
C  2.571718 -1.063311 0.444193
C  3.57228 -0.328839 -0.062477
C  3.497627 -0.317603 -1.525486
C  2.265649 -1.293777 1.876191
C  4.616452 0.422353 0.707326
C  4.0391 1.538436 1.446777
C  3.531739 2.43829 2.062004
H  -2.208569 1.364511 -0.262509
H  -2.06335 -1.720423 -0.351669
H  -0.960739 1.313321 1.807705
H  -1.064567 -0.061171 2.910409
H  -2.346642 1.142657 2.871503
H  -2.986668 -1.778451 2.58656
H  -3.93351 -1.762026 1.103452
H  -4.212934 -0.537541 2.336819
H  -4.137791 -0.821222 -1.204447
H  1.997639 -2.795315 -0.629744
H  1.550273 -0.429632 -2.40424
H  2.538493 -1.849934 -2.696465
H  -7.029034 0.943356 -1.189943
H  -6.254641 1.424616 -2.68394
H  -6.156074 -0.254877 -2.149211
H  -5.667597 2.797483 0.012092
H  -3.909493 2.729664 0.021425
H  -4.777679 3.221002 -1.43244
H  1.554497 -0.546329 2.238232
H  3.157167 -1.213532 2.497879
H  1.81673 -2.27377 2.039642
H  5.127874 -0.245687 1.406384
H  5.383643 0.796204 0.025215
H  3.082458 3.240512 2.602941
elementType: O C H
totalener: -964.17048362 hartree
nucrepener: 1787.90991661 hartree
electener: -2752.08040023 hartree
oneelecener: -4861.14674192 hartree
twoeener: 2109.06634170 hartree
cpcmener: -0.03476717 hartree
kineticenergy: 959.77150414 hartree
xcener: -94.697490374350 hartree
chargesum: -0.0000000
charge: -0.293985 -0.458301 -0.450243 0.157075 0.008138 -0.135442 -0.302916 -0.263396 -0.278419 0.388657 -0.028377 0.270816 -0.227563 -0.252814 -0.144963 0.006744 -0.120077 0.274645 -0.283699 -0.104071 -0.436598 0.020235 0.097786 0.086831 0.096623 0.095269 0.100977 0.097299 0.089038 0.096293 0.119083 0.118704 0.112696 0.105711 0.093868 0.093739 0.088114 0.093897 0.088893 0.098322 0.116572 0.118088 0.118390 0.132726 0.109600 0.286038
qa: -0.2940 -0.4583 -0.4502 0.1571 0.0081 -0.1354 -0.3029 -0.2634 -0.2784 0.3887 -0.0284 0.2708 -0.2276 -0.2528 -0.1450 0.0067 -0.1201 0.2746 -0.2837 -0.1041 -0.4366 0.0202 0.0978 0.0868 0.0966 0.0953 0.1010 0.0973 0.0890 0.0963 0.1191 0.1187 0.1127 0.1057 0.0939 0.0937 0.0881 0.0939 0.0889 0.0983 0.1166 0.1181 0.1184 0.1327 0.1096 0.2860
va: 2.1323 2.0536 2.0577 3.6510 3.7822 3.9020 3.9058 3.9026 3.8766 4.1852 3.7111 3.7966 3.9269 3.9449 3.8643 3.6414 3.5044 4.0729 3.9389 3.8922 3.8094 3.5687 1.0263 1.0413 1.0158 0.9996 1.0030 1.0028 1.0041 1.0031 1.0082 0.9922 1.0255 1.0240 0.9964 0.9955 1.0085 0.9978 1.0082 0.9973 0.9940 0.9965 1.0055 0.9898 1.0210 0.9480
dispcorr: -0.022825446 hartree
energy: -964.193309064988
dipole: -29.65608 27.78526 -1.87082 2.06979 -3.92224 -1.85246 8.93387 -7.40093 1.53294
magnitude: 3.04655 au
magnitude: 7.74372 debye
