program: Orca
programVersion: 5.0.2
elementType: O O O C C C C C C C C C C C C C C C C C C C H H H H H H H H H H H H H H H H H H H H H H H H
charge: 0
multiplicity: 1
keywords: wb97x-d3
keywords: def2-TZVPP
keywords: def2/J RIJCOSX
keywords: DEFGRID2
keywords: scfconv7
keywords: smallprint printgap noloewdin
keywords: NOSOSCF
formula: C19H24O3
InChI: InChI=1/C19H24O3/c1-7-8-13-12(4)16(10-15(13)20)22-18(21)17-14(9-11(2)3)19(17,5)6/h1,9,14,16-17H,8,10H2,2-6H3
46 atoms
O  0.183364 -0.942612 -0.24208
O  -0.371512 -2.77269 0.921233
O  4.00638 0.248678 -2.458299
C  -2.237617 0.300845 1.218621
C  -2.536936 0.032553 -0.226351
C  -1.995713 -1.084095 0.635421
C  -1.089727 1.215791 1.568632
C  -3.387908 0.405249 2.189353
C  -3.927106 -0.06554 -0.737168
C  -0.660938 -1.690908 0.465172
C  -4.576595 0.903361 -1.387935
C  1.515577 -1.402113 -0.490922
C  -5.979257 0.704995 -1.876744
C  -3.987419 2.248674 -1.681065
C  1.971068 -0.934213 -1.866169
C  2.482867 -0.769257 0.479392
C  3.464216 -0.116026 -0.159634
C  3.263248 -0.195672 -1.610473
C  2.312226 -0.912715 1.944251
C  4.623201 0.610858 0.454218
C  4.201205 1.79771 1.188395
C  3.828915 2.761455 1.802527
H  -1.820441 0.469806 -0.914808
H  -2.72195 -1.825147 0.953131
H  -1.465542 2.232823 1.70055
H  -0.318817 1.257033 0.802744
H  -0.620972 0.920428 2.509878
H  -4.187995 -0.302568 1.974189
H  -3.819583 1.40816 2.161792
H  -3.048512 0.219805 3.210487
H  -4.448168 -1.002329 -0.559444
H  1.555808 -2.489827 -0.401487
H  1.248754 -0.250449 -2.318088
H  2.123766 -1.755058 -2.56753
H  -6.362358 -0.287239 -1.63823
H  -6.656032 1.442458 -1.436789
H  -6.041771 0.838531 -2.960149
H  -4.612898 3.039891 -1.259323
H  -2.981986 2.378835 -1.283888
H  -3.949104 2.431635 -2.758351
H  3.205551 -0.619813 2.492037
H  2.064313 -1.939573 2.212127
H  1.49187 -0.284643 2.299145
H  5.170833 -0.05236 1.129431
H  5.329966 0.900888 -0.326793
H  3.499878 3.631235 2.324798
elementType: O C H
totalener: -964.17053393 hartree
nucrepener: 1785.91365705 hartree
electener: -2750.08419098 hartree
oneelecener: -4856.17121641 hartree
twoeener: 2106.08702542 hartree
cpcmener: -0.03184412 hartree
kineticenergy: 959.76909699 hartree
xcener: -94.695393206337 hartree
chargesum: 0.0000000
charge: -0.274612 -0.465256 -0.443981 0.165596 0.026187 -0.156740 -0.331147 -0.267518 -0.288558 0.410405 -0.026789 0.206294 -0.230040 -0.253214 -0.130553 -0.018042 -0.088647 0.283644 -0.263022 -0.098118 -0.452032 0.035390 0.108149 0.089979 0.102064 0.094367 0.106138 0.091223 0.094449 0.098899 0.119626 0.110811 0.102765 0.102038 0.089265 0.093954 0.094031 0.095784 0.087074 0.099379 0.106300 0.118714 0.124971 0.132837 0.110803 0.287135
qa: -0.2746 -0.4653 -0.4440 0.1656 0.0262 -0.1567 -0.3311 -0.2675 -0.2886 0.4104 -0.0268 0.2063 -0.2300 -0.2532 -0.1306 -0.0180 -0.0886 0.2836 -0.2630 -0.0981 -0.4520 0.0354 0.1081 0.0900 0.1021 0.0944 0.1061 0.0912 0.0944 0.0989 0.1196 0.1108 0.1028 0.1020 0.0893 0.0940 0.0940 0.0958 0.0871 0.0994 0.1063 0.1187 0.1250 0.1328 0.1108 0.2871
va: 2.1080 2.0381 2.0640 3.6277 3.7516 3.9429 3.9079 3.9044 3.8604 4.1829 3.7055 3.7724 3.9286 3.9444 3.9121 3.6891 3.5079 4.0630 3.9327 3.8875 3.8268 3.5461 1.0120 1.0346 1.0039 1.0123 0.9951 1.0031 1.0028 1.0026 1.0084 1.0298 1.0265 1.0231 1.0079 0.9963 0.9956 0.9978 1.0082 0.9979 1.0011 1.0122 0.9913 0.9886 1.0212 0.9472
dispcorr: -0.023092616 hartree
energy: -964.193626547233
dipole: -25.68269 24.34976 -1.33293 9.61381 -9.19644 0.41737 4.99924 -4.03422 0.96502
magnitude: 1.69769 au
magnitude: 4.31519 debye
