program: Orca
programVersion: 5.0.2
elementType: O O O C C C C C C C C C C C C C C C C C C C H H H H H H H H H H H H H H H H H H H H H H H H
charge: 0
multiplicity: 1
keywords: wb97x-d3
keywords: def2-TZVPP
keywords: def2/J RIJCOSX
keywords: DEFGRID2
keywords: scfconv7
keywords: smallprint printgap noloewdin
keywords: NOSOSCF
formula: C19H24O3
InChI: InChI=1/C19H24O3/c1-7-8-13-12(4)16(10-15(13)20)22-18(21)17-14(9-11(2)3)19(17,5)6/h1,9,14,16-17H,8,10H2,2-6H3
46 atoms
O  0.14079 -0.861069 -0.262245
O  -0.381047 -2.759562 0.80004
O  3.879616 0.571605 -2.431296
C  -2.244507 0.245224 1.405823
C  -2.556294 0.15122 -0.059601
C  -2.014908 -1.062368 0.665662
C  -1.082648 1.104667 1.841187
C  -3.374943 0.241826 2.406358
C  -3.941765 0.112285 -0.57377
C  -0.683558 -1.652064 0.42094
C  -4.470611 0.926293 -1.49325
C  1.456921 -1.316649 -0.594253
C  -5.8955 0.765763 -1.93203
C  -3.740144 2.051976 -2.159439
C  1.88044 -0.707262 -1.923819
C  2.463362 -0.809574 0.410702
C  3.421258 -0.079453 -0.178372
C  3.170267 0.016307 -1.620792
C  2.350884 -1.145347 1.849847
C  4.601195 0.574722 0.47586
C  4.210222 1.710068 1.302793
C  3.868549 2.629455 1.997441
H  -1.839522 0.660678 -0.693583
H  -2.742011 -1.83191 0.903677
H  -0.609717 0.702255 2.739927
H  -1.443522 2.105762 2.086792
H  -0.31651 1.219586 1.077321
H  -3.014551 -0.064694 3.390389
H  -4.185059 -0.431987 2.130261
H  -3.79839 1.243487 2.507764
H  -4.582748 -0.659181 -0.155973
H  1.473731 -2.408145 -0.625998
H  1.140602 0.003146 -2.299414
H  2.034737 -1.455695 -2.7020
H  -6.392009 -0.064728 -1.429632
H  -6.473549 1.67259 -1.734061
H  -5.957655 0.591653 -3.009784
H  -2.70741 2.162995 -1.834649
H  -3.735907 1.921427 -3.244783
H  -4.247177 3.001252 -1.96757
H  3.223989 -0.82802 2.417036
H  2.222902 -2.220349 1.986583
H  1.476786 -0.663166 2.294797
H  5.141527 -0.148284 1.09309
H  5.305687 0.909392 -0.289381
H  3.569513 3.449069 2.611127
elementType: O C H
totalener: -964.17174300 hartree
nucrepener: 1784.84472848 hartree
electener: -2749.01647148 hartree
oneelecener: -4854.06360851 hartree
twoeener: 2105.04713704 hartree
cpcmener: -0.03254748 hartree
kineticenergy: 959.76039910 hartree
xcener: -94.694248120309 hartree
chargesum: -0.0000000
charge: -0.275935 -0.464751 -0.443969 0.121888 0.068476 -0.135156 -0.301633 -0.268291 -0.295209 0.405322 -0.045253 0.206840 -0.220481 -0.253169 -0.131704 -0.022456 -0.087636 0.286963 -0.254386 -0.100608 -0.453493 0.038644 0.100334 0.088927 0.101678 0.102209 0.091022 0.097852 0.087515 0.095899 0.117816 0.110554 0.101917 0.102493 0.087651 0.092606 0.093278 0.088112 0.095882 0.095973 0.101248 0.120927 0.120505 0.133216 0.111246 0.287138
qa: -0.2759 -0.4648 -0.4440 0.1219 0.0685 -0.1352 -0.3016 -0.2683 -0.2952 0.4053 -0.0453 0.2068 -0.2205 -0.2532 -0.1317 -0.0225 -0.0876 0.2870 -0.2544 -0.1006 -0.4535 0.0386 0.1003 0.0889 0.1017 0.1022 0.0910 0.0979 0.0875 0.0959 0.1178 0.1106 0.1019 0.1025 0.0877 0.0926 0.0933 0.0881 0.0959 0.0960 0.1012 0.1209 0.1205 0.1332 0.1112 0.2871
va: 2.1129 2.0356 2.0642 3.6699 3.7305 3.8944 3.9074 3.9083 3.8572 4.1767 3.7576 3.7728 3.9238 3.9444 3.9112 3.6980 3.5052 4.0640 3.9417 3.8835 3.8283 3.5458 1.0191 1.0353 0.9963 1.0034 1.0136 1.0019 1.0060 1.0027 1.0104 1.0290 1.0270 1.0228 1.0089 0.9965 0.9961 1.0106 0.9969 0.9975 1.0038 1.0077 0.9921 0.9886 1.0205 0.9471
dispcorr: -0.022580586 hartree
energy: -964.194323583495
dipole: -24.80801 23.57444 -1.23356 7.87707 -7.73135 0.14572 4.75505 -3.82551 0.92954
magnitude: 1.55144 au
magnitude: 3.94344 debye
