program: Orca
programVersion: 5.0.2
elementType: O O O C C C C C C C C C C C C C C C C C C C H H H H H H H H H H H H H H H H H H H H H H H H
charge: 0
multiplicity: 1
keywords: wb97x-d3
keywords: def2-TZVPP
keywords: def2/J RIJCOSX
keywords: DEFGRID2
keywords: scfconv7
keywords: smallprint printgap noloewdin
keywords: NOSOSCF
formula: C19H24O3
InChI: InChI=1/C19H24O3/c1-7-8-13-12(4)16(10-15(13)20)22-18(21)17-14(9-11(2)3)19(17,5)6/h1,9,14,16-17H,8,10H2,2-6H3
46 atoms
O  0.192554 -0.953643 -0.245284
O  -0.400788 -2.833717 0.815259
O  4.038097 0.233946 -2.427007
C  -2.262434 0.194265 1.28403
C  -2.515944 0.073052 -0.189985
C  -2.010905 -1.127808 0.574553
C  -1.118326 1.057151 1.754932
C  -3.440039 0.213584 2.227602
C  -3.890006 0.041834 -0.748351
C  -0.672903 -1.729496 0.405511
C  -4.478111 1.039905 -1.414101
C  1.527914 -1.413584 -0.481747
C  -5.87554 0.905169 -1.938883
C  -3.827474 2.360896 -1.688254
C  2.001294 -0.956601 -1.854762
C  2.480603 -0.77188 0.496155
C  3.468281 -0.1197 -0.133938
C  3.286201 -0.209436 -1.586635
C  2.286216 -0.902512 1.959449
C  4.61009 0.625449 0.489806
C  4.164905 1.854204 1.136491
C  3.772101 2.857576 1.668762
H  -1.775424 0.570257 -0.808079
H  -2.751441 -1.889499 0.796572
H  -0.317842 1.153016 1.024376
H  -0.689385 0.672403 2.682837
H  -1.485583 2.064692 1.96211
H  -3.134277 -0.089218 3.231098
H  -4.243823 -0.45136 1.913061
H  -3.855298 1.221322 2.299222
H  -4.458877 -0.869868 -0.587437
H  1.568536 -2.500233 -0.383132
H  1.282722 -0.28258 -2.32676
H  2.170561 -1.784616 -2.544078
H  -6.308844 -0.069846 -1.715722
H  -6.529998 1.670273 -1.512316
H  -5.904578 1.04618 -3.022753
H  -2.815744 2.440012 -1.293989
H  -3.785168 2.559072 -2.762679
H  -4.414531 3.172968 -1.250622
H  1.959425 -1.908117 2.226707
H  1.511869 -0.212665 2.30568
H  3.19537 -0.674712 2.514843
H  5.119374 -0.004025 1.224712
H  5.353477 0.866579 -0.273765
H  3.422581 3.749073 2.139103
elementType: O C H
totalener: -964.17068934 hartree
nucrepener: 1784.85749670 hartree
electener: -2749.02818604 hartree
oneelecener: -4854.05031759 hartree
twoeener: 2105.02213155 hartree
cpcmener: -0.03220335 hartree
kineticenergy: 959.76099630 hartree
xcener: -94.693846011251 hartree
chargesum: 0.0000000
charge: -0.276304 -0.464264 -0.443805 0.167169 0.033049 -0.163566 -0.325280 -0.265439 -0.293058 0.415927 -0.026733 0.206734 -0.229100 -0.253402 -0.130508 -0.018149 -0.090642 0.284419 -0.264893 -0.098858 -0.447676 0.030740 0.105106 0.090027 0.091561 0.105531 0.101407 0.098397 0.090137 0.094398 0.119523 0.110632 0.102528 0.101754 0.089306 0.093867 0.094048 0.087259 0.097346 0.095876 0.117293 0.124625 0.111324 0.133419 0.111344 0.286932
qa: -0.2763 -0.4643 -0.4438 0.1672 0.0330 -0.1636 -0.3253 -0.2654 -0.2931 0.4159 -0.0267 0.2067 -0.2291 -0.2534 -0.1305 -0.0181 -0.0906 0.2844 -0.2649 -0.0989 -0.4477 0.0307 0.1051 0.0900 0.0916 0.1055 0.1014 0.0984 0.0901 0.0944 0.1195 0.1106 0.1025 0.1018 0.0893 0.0939 0.0940 0.0873 0.0973 0.0959 0.1173 0.1246 0.1113 0.1334 0.1113 0.2869
va: 2.1117 2.0393 2.0641 3.6329 3.7439 3.9421 3.9115 3.9046 3.8641 4.1760 3.7127 3.7723 3.9274 3.9459 3.9101 3.6888 3.5124 4.0637 3.9234 3.8827 3.8253 3.5534 1.0138 1.0354 1.0115 0.9940 1.0045 1.0025 1.0037 1.0034 1.0085 1.0314 1.0264 1.0233 1.0081 0.9962 0.9957 1.0090 0.9979 0.9975 1.0137 0.9939 1.0004 0.9891 1.0207 0.9473
dispcorr: -0.022911789 hartree
energy: -964.193601127480
dipole: -25.48462 24.16236 -1.32226 9.62811 -9.20598 0.42213 5.47125 -4.39704 1.07420
magnitude: 1.75513 au
magnitude: 4.46119 debye
