program: Orca
programVersion: 5.0.2
elementType: O O O C C C C C C C C C C C C C C C C C C C H H H H H H H H H H H H H H H H H H H H H H H H
charge: 0
multiplicity: 1
keywords: wb97x-d3
keywords: def2-TZVPP
keywords: def2/J RIJCOSX
keywords: DEFGRID2
keywords: scfconv7
keywords: smallprint printgap noloewdin
keywords: NOSOSCF
formula: C19H24O3
InChI: InChI=1/C19H24O3/c1-7-8-13-12(4)16(10-15(13)20)22-18(21)17-14(9-11(2)3)19(17,5)6/h1,9,14,16-17H,8,10H2,2-6H3
46 atoms
O  0.076396 -0.616646 -0.114838
O  -0.209281 -2.319149 1.308235
O  3.892391 0.564562 -2.458313
C  -2.515811 0.438585 1.227624
C  -2.767479 -0.040795 -0.1723
C  -2.06614 -0.952852 0.810434
C  -1.518861 1.551469 1.441313
C  -3.66497 0.489552 2.204526
C  -4.122246 -0.410508 -0.639558
C  -0.654483 -1.370838 0.704767
C  -4.811441 0.186695 -1.6166
C  1.461197 -0.914096 -0.304423
C  -6.184101 -0.288718 -1.986869
C  -4.318813 1.356055 -2.413667
C  1.876751 -0.578665 -1.729781
C  2.33554 -0.048213 0.570784
C  3.289937 0.56189 -0.147239
C  3.13717 0.236623 -1.569173
C  2.148943 0.003929 2.03955
C  4.401426 1.432482 0.358064
C  5.438544 0.663867 1.035923
C  6.282987 0.027891 1.607574
H  -2.122873 0.413935 -0.916784
H  -2.674256 -1.750472 1.224664
H  -1.014784 1.450727 2.40494
H  -2.042082 2.510034 1.448791
H  -0.759315 1.607106 0.664675
H  -3.294871 0.489064 3.231833
H  -4.349325 -0.35203 2.10254
H  -4.244061 1.404821 2.062927
H  -4.594493 -1.242296 -0.124158
H  1.6481 -1.966289 -0.077281
H  1.121932 0.034315 -2.22903
H  2.047459 -1.458664 -2.350084
H  -6.496867 -1.149454 -1.395372
H  -6.925014 0.503065 -1.845747
H  -6.232954 -0.570925 -3.042155
H  -4.273958 1.109721 -3.477916
H  -5.012378 2.19645 -2.32431
H  -3.335092 1.711876 -2.112717
H  2.269666 -0.991004 2.473942
H  1.14353 0.341545 2.299329
H  2.85924 0.672658 2.521819
H  4.846924 1.978816 -0.476588
H  4.009388 2.188477 1.043282
H  7.031036 -0.54388 2.109051
elementType: O C H
totalener: -964.17128820 hartree
nucrepener: 1767.70823439 hartree
electener: -2731.87952259 hartree
oneelecener: -4819.59138566 hartree
twoeener: 2087.71186307 hartree
cpcmener: -0.03312649 hartree
kineticenergy: 959.76093893 hartree
xcener: -94.694671377179 hartree
chargesum: -0.0000000
charge: -0.275690 -0.463788 -0.444504 0.145886 0.056826 -0.150550 -0.318932 -0.264606 -0.298302 0.403900 -0.033625 0.208240 -0.224437 -0.252908 -0.130285 -0.025429 -0.087211 0.289319 -0.247229 -0.114598 -0.458399 0.053183 0.102623 0.089732 0.102341 0.103614 0.094886 0.098085 0.088245 0.094800 0.118214 0.111596 0.103522 0.098865 0.088212 0.093626 0.092748 0.096822 0.095263 0.087567 0.120596 0.118883 0.099401 0.113208 0.133412 0.286876
qa: -0.2757 -0.4638 -0.4445 0.1459 0.0568 -0.1505 -0.3189 -0.2646 -0.2983 0.4039 -0.0336 0.2082 -0.2244 -0.2529 -0.1303 -0.0254 -0.0872 0.2893 -0.2472 -0.1146 -0.4584 0.0532 0.1026 0.0897 0.1023 0.1036 0.0949 0.0981 0.0882 0.0948 0.1182 0.1116 0.1035 0.0989 0.0882 0.0936 0.0927 0.0968 0.0953 0.0876 0.1206 0.1189 0.0994 0.1132 0.1334 0.2869
va: 2.1142 2.0363 2.0621 3.6413 3.7357 3.9215 3.9091 3.9065 3.8641 4.1782 3.7347 3.7735 3.9257 3.9460 3.9198 3.7236 3.5003 4.0713 3.9459 3.8852 3.8291 3.5317 1.0174 1.0362 0.9950 1.0036 1.0122 1.0020 1.0053 1.0034 1.0096 1.0304 1.0248 1.0247 1.0087 0.9962 0.9961 0.9971 0.9976 1.0094 1.0030 0.9959 1.0041 1.0175 0.9885 0.9469
dispcorr: -0.022412141 hartree
energy: -964.193700337468
dipole: -28.64531 26.75636 -1.88895 8.10595 -7.20602 0.89993 2.99281 -2.12693 0.86587
magnitude: 2.26445 au
magnitude: 5.75578 debye
