program: Orca
programVersion: 5.0.2
elementType: O O O C C C C C C C C C C C C C C C C C C C H H H H H H H H H H H H H H H H H H H H H H H H
charge: 0
multiplicity: 1
keywords: wb97x-d3
keywords: def2-TZVPP
keywords: def2/J RIJCOSX
keywords: DEFGRID2
keywords: scfconv7
keywords: smallprint printgap noloewdin
keywords: NOSOSCF
formula: C19H24O3
InChI: InChI=1/C19H24O3/c1-7-8-13-12(4)16(10-15(13)20)22-18(21)17-14(9-11(2)3)19(17,5)6/h1,9,14,16-17H,8,10H2,2-6H3
46 atoms
O  0.017401 -0.573844 -0.155653
O  -0.267469 -2.523142 0.90666
O  3.728301 1.141455 -2.288228
C  -2.511741 0.24219 1.435185
C  -2.785963 0.067981 -0.028485
C  -2.103969 -1.048747 0.742518
C  -1.477012 1.256643 1.858694
C  -3.637005 0.114018 2.433861
C  -4.138333 -0.165137 -0.570896
C  -0.707556 -1.463129 0.518248
C  -4.64148 0.34087 -1.702232
C  1.395814 -0.829106 -0.434856
C  -6.038853 0.007861 -2.1318
C  -3.909642 1.254235 -2.637711
C  1.773366 -0.202185 -1.769614
C  2.289173 -0.157892 0.580698
C  3.205804 0.619795 -0.015274
C  3.013019 0.601844 -1.467371
C  2.153193 -0.434061 2.029556
C  4.319232 1.382227 0.639079
C  5.42891 0.509223 1.002819
C  6.326052 -0.230066 1.30853
H  -2.124359 0.64166 -0.666607
H  -2.729364 -1.897612 0.996813
H  -1.971459 2.202825 2.086873
H  -0.729454 1.460544 1.09559
H  -0.959933 0.933792 2.764565
H  -4.34599 -0.672031 2.179156
H  -4.190133 1.052412 2.508001
H  -3.238602 -0.112415 3.42449
H  -4.778275 -0.822644 0.010435
H  1.583944 -1.904825 -0.43444
H  0.992032 0.472163 -2.128369
H  1.958442 -0.936143 -2.553464
H  -6.532578 -0.672483 -1.438229
H  -6.649781 0.91085 -2.211776
H  -6.044544 -0.455087 -3.122051
H  -4.473947 2.178271 -2.787638
H  -2.912299 1.52859 -2.299856
H  -3.811157 0.793013 -3.623823
H  2.89228 0.100878 2.622214
H  2.267377 -1.502478 2.223296
H  1.163692 -0.150794 2.394599
H  4.67882 2.164436 -0.033116
H  3.955749 1.891482 1.534496
H  7.126448 -0.88403 1.572664
elementType: O C H
totalener: -964.16206918 hartree
nucrepener: 1772.29146278 hartree
electener: -2736.45353196 hartree
oneelecener: -4828.70169566 hartree
twoeener: 2092.24816370 hartree
cpcmener: -0.04129053 hartree
kineticenergy: 959.76214179 hartree
xcener: -94.698191595934 hartree
chargesum: 0.0000000
charge: -0.277387 -0.495644 -0.480515 0.111983 0.058917 -0.112240 -0.303568 -0.278522 -0.296162 0.423027 -0.050228 0.208648 -0.219915 -0.253677 -0.131636 -0.019367 -0.092843 0.318228 -0.250179 -0.112703 -0.455969 0.041846 0.104054 0.091583 0.104806 0.093334 0.103257 0.090506 0.096996 0.097828 0.120745 0.112715 0.105828 0.101470 0.088884 0.094066 0.092896 0.095485 0.089269 0.097636 0.100986 0.120801 0.122907 0.113634 0.136111 0.292111
qa: -0.2774 -0.4956 -0.4805 0.1120 0.0589 -0.1122 -0.3036 -0.2785 -0.2962 0.4230 -0.0502 0.2086 -0.2199 -0.2537 -0.1316 -0.0194 -0.0928 0.3182 -0.2502 -0.1127 -0.4560 0.0418 0.1041 0.0916 0.1048 0.0933 0.1033 0.0905 0.0970 0.0978 0.1207 0.1127 0.1058 0.1015 0.0889 0.0941 0.0929 0.0955 0.0893 0.0976 0.1010 0.1208 0.1229 0.1136 0.1361 0.2921
va: 2.1161 1.9970 2.0179 3.6622 3.7469 3.8490 3.9066 3.9119 3.8648 4.1584 3.7661 3.7745 3.9208 3.9408 3.9309 3.7221 3.5150 4.0377 3.9413 3.8852 3.8208 3.5326 1.0160 1.0322 1.0027 1.0127 0.9951 1.0068 1.0015 1.0013 1.0114 1.0297 1.0248 1.0235 1.0088 0.9960 0.9962 0.9971 1.0116 0.9963 1.0044 1.0030 0.9943 1.0163 0.9890 0.9436
dispcorr: -0.022317844 hartree
energy: -964.184387025490
dipole: -27.18365 25.33086 -1.85279 6.08819 -5.47139 0.61680 3.75686 -2.65286 1.10399
magnitude: 2.24323 au
magnitude: 5.70183 debye
