program: Orca
programVersion: 5.0.2
elementType: O O O C C C C C C C C C C C C C C C C C C C H H H H H H H H H H H H H H H H H H H H H H H H
charge: 0
multiplicity: 1
keywords: wb97x-d3
keywords: def2-TZVPP
keywords: def2/J RIJCOSX
keywords: DEFGRID2
keywords: scfconv7
keywords: smallprint printgap noloewdin
keywords: NOSOSCF
formula: C19H24O3
InChI: InChI=1/C19H24O3/c1-7-8-13-12(4)16(10-15(13)20)22-18(21)17-14(9-11(2)3)19(17,5)6/h1,9,14,16-17H,8,10H2,2-6H3
46 atoms
O  0.558859 -0.862135 -0.108143
O  -0.594623 -0.737359 1.810481
O  4.980204 -1.699615 -0.965917
C  -2.999996 -1.300123 -0.148973
C  -2.976961 0.146731 0.234627
C  -1.71524 -0.494874 -0.291786
C  -3.142671 -2.33961 0.934794
C  -3.669142 -1.693688 -1.442595
C  -3.643443 1.190375 -0.582871
C  -0.563088 -0.705162 0.601269
C  -4.821292 1.752497 -0.298059
C  1.797744 -1.118964 0.562222
C  -5.409804 2.80921 -1.182452
C  -5.650194 1.386036 0.894008
C  2.669422 -2.022126 -0.299164
C  2.590974 0.155135 0.720854
C  3.814501 0.042885 0.182912
C  3.972122 -1.274938 -0.436917
C  2.029246 1.328194 1.42865
C  4.900944 1.076127 0.174622
C  4.617534 2.158594 -0.75976
C  4.363714 3.048942 -1.526605
H  -2.977804 0.318591 1.30714
H  -1.448091 -0.254287 -1.315133
H  -4.194264 -2.614264 1.035764
H  -2.804975 -1.994937 1.909433
H  -2.590936 -3.248224 0.685808
H  -3.490221 -0.97721 -2.243503
H  -4.7493 -1.76945 -1.301057
H  -3.311208 -2.667495 -1.781502
H  -3.125685 1.508617 -1.483294
H  1.60799 -1.562904 1.541528
H  2.236225 -2.175662 -1.28992
H  2.830256 -3.006145 0.141714
H  -6.381987 2.496273 -1.571798
H  -5.583887 3.733982 -0.626495
H  -4.76565 3.041731 -2.030204
H  -6.635164 1.033218 0.577925
H  -5.202663 0.607079 1.508769
H  -5.82627 2.258344 1.528221
H  1.684645 1.044804 2.424543
H  1.163308 1.725775 0.894735
H  2.754036 2.133209 1.530758
H  5.034102 1.493014 1.175817
H  5.852162 0.609937 -0.091403
H  4.147116 3.838578 -2.210264
elementType: O C H
totalener: -964.16305012 hartree
nucrepener: 1742.12276352 hartree
electener: -2706.28581364 hartree
oneelecener: -4768.99205957 hartree
twoeener: 2062.70624593 hartree
cpcmener: -0.03811748 hartree
kineticenergy: 959.76775641 hartree
xcener: -94.696646030564 hartree
chargesum: 0.0000000
charge: -0.294606 -0.497146 -0.480595 0.148794 -0.006644 -0.129525 -0.299695 -0.269515 -0.267524 0.420610 -0.036825 0.254987 -0.229900 -0.250810 -0.136558 -0.022513 -0.099088 0.314815 -0.247527 -0.096936 -0.463312 0.041024 0.100010 0.090829 0.097521 0.091699 0.103839 0.092094 0.096557 0.098830 0.124686 0.106034 0.104250 0.103510 0.094556 0.094881 0.090121 0.096507 0.088485 0.098894 0.119941 0.117244 0.099958 0.135394 0.110332 0.292316
qa: -0.2946 -0.4971 -0.4806 0.1488 -0.0066 -0.1295 -0.2997 -0.2695 -0.2675 0.4206 -0.0368 0.2550 -0.2299 -0.2508 -0.1366 -0.0225 -0.0991 0.3148 -0.2475 -0.0969 -0.4633 0.0410 0.1000 0.0908 0.0975 0.0917 0.1038 0.0921 0.0966 0.0988 0.1247 0.1060 0.1043 0.1035 0.0946 0.0949 0.0901 0.0965 0.0885 0.0989 0.1199 0.1172 0.1000 0.1354 0.1103 0.2923
va: 2.1306 2.0017 2.0192 3.6622 3.7806 3.9150 3.9044 3.9077 3.8685 4.1465 3.7033 3.7455 3.9263 3.9413 3.9164 3.7482 3.5391 4.0263 3.9367 3.8767 3.8270 3.5303 1.0241 1.0391 1.0007 1.0176 0.9984 1.0022 1.0023 1.0028 1.0061 1.0296 1.0288 1.0224 0.9962 0.9954 1.0076 0.9974 1.0081 0.9982 1.0053 0.9981 1.0041 0.9885 1.0201 0.9436
dispcorr: -0.021356330 hartree
energy: -964.184406451571
dipole: -33.26578 31.17987 -2.08591 4.98226 -4.36336 0.61890 0.51418 -0.14647 0.36771
magnitude: 2.20664 au
magnitude: 5.60883 debye
