program: Orca
programVersion: 5.0.2
elementType: O O O C C C C C C C C C C C C C C C C C C C H H H H H H H H H H H H H H H H H H H H H H H H
charge: 0
multiplicity: 1
keywords: wb97x-d3
keywords: def2-TZVPP
keywords: def2/J RIJCOSX
keywords: DEFGRID2
keywords: scfconv7
keywords: smallprint printgap noloewdin
keywords: NOSOSCF
formula: C19H24O3
InChI: InChI=1/C19H24O3/c1-7-8-13-12(4)16(10-15(13)20)22-18(21)17-14(9-11(2)3)19(17,5)6/h1,9,14,16-17H,8,10H2,2-6H3
46 atoms
O  0.330988 -1.490779 -0.311826
O  -0.038841 0.705138 -0.106246
O  3.943031 1.041855 -2.024982
C  -2.638803 -0.439468 1.30478
C  -2.96623 0.195192 -0.013089
C  -1.861258 -0.839135 0.0585
C  -1.990769 0.411601 2.368998
C  -3.551282 -1.496952 1.877473
C  -4.198072 -0.117432 -0.763269
C  -0.45953 -0.428614 -0.127527
C  -4.996326 0.757139 -1.385138
C  1.736754 -1.298825 -0.47243
C  -6.226436 0.290714 -2.105187
C  -4.7809 2.239434 -1.42943
C  2.175974 -0.601844 -1.756835
C  2.394108 -0.525643 0.644525
C  3.271999 0.367362 0.163145
C  3.234739 0.370723 -1.299028
C  2.120084 -0.860283 2.060692
C  4.204315 1.251055 0.935048
C  5.477318 0.591521 1.200626
C  6.52343 0.044711 1.427482
H  -2.606224 1.213921 -0.106103
H  -2.095453 -1.827927 -0.320235
H  -2.762098 0.840412 3.011449
H  -1.41036 1.238651 1.966112
H  -1.333551 -0.187556 3.00307
H  -3.944575 -2.175987 1.122625
H  -4.399484 -1.033774 2.385415
H  -3.016441 -2.099816 2.613393
H  -4.473417 -1.16697 -0.809397
H  2.125932 -2.318812 -0.446774
H  1.367183 -0.060492 -2.250564
H  2.586759 -1.297944 -2.488604
H  -7.123962 0.75165 -1.684451
H  -6.197618 0.580472 -3.158769
H  -6.348741 -0.791069 -2.055814
H  -4.760815 2.592668 -2.463753
H  -5.611275 2.759832 -0.944517
H  -3.861816 2.569596 -0.94939
H  2.754824 -0.3045 2.747185
H  2.279353 -1.926905 2.23176
H  1.080223 -0.654035 2.325058
H  4.387345 2.172739 0.377547
H  3.751093 1.55139 1.881851
H  7.442202 -0.456683 1.633667
elementType: O C H
totalener: -964.16204228 hartree
nucrepener: 1769.06337327 hartree
electener: -2733.22541554 hartree
oneelecener: -4823.19899065 hartree
twoeener: 2089.97357510 hartree
cpcmener: -0.04262272 hartree
kineticenergy: 959.76717849 hartree
xcener: -94.700357565919 hartree
chargesum: -0.0000000
charge: -0.299661 -0.490179 -0.486452 0.115112 0.034285 -0.101586 -0.291458 -0.275115 -0.284540 0.401758 -0.053741 0.280292 -0.217323 -0.250780 -0.146765 0.005648 -0.138480 0.311716 -0.249114 -0.133662 -0.448942 0.042958 0.095055 0.091235 0.105336 0.095838 0.096505 0.090747 0.097872 0.097857 0.121395 0.123013 0.114091 0.109438 0.093422 0.093222 0.088771 0.094828 0.097603 0.089737 0.101461 0.117229 0.118474 0.118704 0.132702 0.291489
qa: -0.2997 -0.4902 -0.4865 0.1151 0.0343 -0.1016 -0.2915 -0.2751 -0.2845 0.4018 -0.0537 0.2803 -0.2173 -0.2508 -0.1468 0.0056 -0.1385 0.3117 -0.2491 -0.1337 -0.4489 0.0430 0.0951 0.0912 0.1053 0.0958 0.0965 0.0907 0.0979 0.0979 0.1214 0.1230 0.1141 0.1094 0.0934 0.0932 0.0888 0.0948 0.0976 0.0897 0.1015 0.1172 0.1185 0.1187 0.1327 0.2915
va: 2.1331 2.0174 2.0118 3.6702 3.7877 3.8288 3.9038 3.9085 3.8704 4.1774 3.7659 3.7787 3.9196 3.9403 3.8822 3.6579 3.5215 4.0512 3.9530 3.8951 3.8205 3.5345 1.0302 1.0366 1.0016 1.0164 1.0000 1.0062 1.0016 1.0018 1.0103 0.9925 1.0249 1.0227 0.9958 0.9967 1.0087 0.9971 0.9966 1.0109 1.0029 0.9982 0.9955 1.0113 0.9916 0.9439
dispcorr: -0.021992859 hartree
energy: -964.184035134397
dipole: -30.48975 28.36448 -2.12527 -0.25087 -1.66449 -1.91536 7.04613 -5.40032 1.64580
magnitude: 3.30061 au
magnitude: 8.38949 debye
