program: Orca
programVersion: 5.0.2
elementType: O O O C C C C C C C C C C C C C C C C C C C H H H H H H H H H H H H H H H H H H H H H H H H
charge: 0
multiplicity: 1
keywords: wb97x-d3
keywords: def2-TZVPP
keywords: def2/J RIJCOSX
keywords: DEFGRID2
keywords: scfconv7
keywords: smallprint printgap noloewdin
keywords: NOSOSCF
formula: C19H24O3
InChI: InChI=1/C19H24O3/c1-7-8-13-12(4)16(10-15(13)20)22-18(21)17-14(9-11(2)3)19(17,5)6/h1,9,14,16-17H,8,10H2,2-6H3
46 atoms
O  0.492942 0.015182 0.228916
O  -0.804075 -1.182175 1.59743
O  4.574581 -2.1323 0.361821
C  -2.704222 -1.202408 -0.909979
C  -3.19087 -0.17941 0.069602
C  -1.736837 -0.163966 -0.362249
C  -2.622821 -2.641516 -0.464508
C  -3.060206 -1.058833 -2.369906
C  -4.05533 0.951268 -0.328673
C  -0.677683 -0.511554 0.597768
C  -5.228253 1.284506 0.219541
C  1.62856 -0.227976 1.063073
C  -5.999881 2.469173 -0.279874
C  -5.884674 0.543549 1.343605
C  2.257263 -1.601959 0.860228
C  2.691921 0.756672 0.660075
C  3.851986 0.145487 0.380901
C  3.696169 -1.305763 0.508726
C  2.406534 2.209348 0.630812
C  5.145021 0.793973 -0.012746
C  5.103525 1.306702 -1.377059
C  5.054975 1.733174 -2.499997
H  -3.35351 -0.570061 1.068627
H  -1.461203 0.61066 -1.069139
H  -3.546018 -3.156154 -0.736789
H  -2.495811 -2.75417 0.609495
H  -1.800872 -3.161088 -0.960909
H  -2.363577 -1.625965 -2.989719
H  -3.038558 -0.025064 -2.711423
H  -4.062019 -1.450897 -2.555949
H  -3.689562 1.563029 -1.148598
H  1.357132 -0.057401 2.108661
H  1.789395 -2.14449 0.035282
H  2.197714 -2.236561 1.744279
H  -6.987322 2.170573 -0.641299
H  -6.171567 3.190649 0.523252
H  -5.485912 2.984881 -1.09098
H  -5.316725 -0.314949 1.696703
H  -6.054713 1.206459 2.19574
H  -6.869222 0.18248 1.034922
H  1.803798 2.504688 1.490758
H  1.832637 2.467414 -0.262325
H  3.316846 2.806126 0.620876
H  5.377886 1.615453 0.669672
H  5.963599 0.076715 0.079914
H  5.005886 2.105697 -3.49847
elementType: O C H
totalener: -964.16501426 hartree
nucrepener: 1734.06827291 hartree
electener: -2698.23328717 hartree
oneelecener: -4752.91084881 hartree
twoeener: 2054.67756164 hartree
cpcmener: -0.03990520 hartree
kineticenergy: 959.76621250 hartree
xcener: -94.696523747518 hartree
chargesum: -0.0000000
charge: -0.296278 -0.499841 -0.479437 0.112314 0.036746 -0.098071 -0.281684 -0.264784 -0.288117 0.411016 -0.044188 0.236556 -0.219692 -0.252616 -0.138151 -0.018832 -0.088061 0.317261 -0.270154 -0.097823 -0.459095 0.038749 0.095264 0.091502 0.097624 0.092051 0.100103 0.098220 0.089057 0.097316 0.123173 0.108645 0.107621 0.106050 0.093763 0.093820 0.088655 0.090004 0.096566 0.096309 0.119301 0.115986 0.104923 0.135717 0.110422 0.292089
qa: -0.2963 -0.4998 -0.4794 0.1123 0.0367 -0.0981 -0.2817 -0.2648 -0.2881 0.4110 -0.0442 0.2366 -0.2197 -0.2526 -0.1382 -0.0188 -0.0881 0.3173 -0.2702 -0.0978 -0.4591 0.0387 0.0953 0.0915 0.0976 0.0921 0.1001 0.0982 0.0891 0.0973 0.1232 0.1086 0.1076 0.1060 0.0938 0.0938 0.0887 0.0900 0.0966 0.0963 0.1193 0.1160 0.1049 0.1357 0.1104 0.2921
va: 2.1322 2.0032 2.0219 3.6857 3.7717 3.8839 3.9038 3.9059 3.8703 4.1208 3.7490 3.7830 3.9209 3.9431 3.9007 3.7330 3.5373 4.0327 3.9501 3.8721 3.8254 3.5335 1.0300 1.0356 1.0003 1.0187 0.9992 1.0022 1.0052 1.0021 1.0088 1.0165 1.0226 1.0233 0.9963 0.9961 1.0087 1.0095 0.9969 0.9973 1.0009 0.9993 1.0009 0.9885 1.0198 0.9436
dispcorr: -0.020690661 hartree
energy: -964.185704918552
dipole: -31.42926 29.70746 -1.72179 6.10282 -4.02117 2.08165 -3.81515 3.59622 -0.21893
magnitude: 2.71031 au
magnitude: 6.88906 debye
