program: Orca
programVersion: 5.0.2
elementType: O O O C C C C C C C C C C C C C C C C C C C H H H H H H H H H H H H H H H H H H H H H H H H
charge: 0
multiplicity: 1
keywords: wb97x-d3
keywords: def2-TZVPP
keywords: def2/J RIJCOSX
keywords: DEFGRID2
keywords: scfconv7
keywords: smallprint printgap noloewdin
keywords: NOSOSCF
formula: C19H24O3
InChI: InChI=1/C19H24O3/c1-7-8-13-12(4)16(10-15(13)20)22-18(21)17-14(9-11(2)3)19(17,5)6/h1,9,14,16-17H,8,10H2,2-6H3
46 atoms
O  0.372166 -1.734655 -0.421988
O  0.327389 0.500704 -0.331228
O  4.311112 0.141014 -2.264329
C  -2.379523 -0.165722 1.166388
C  -2.651089 0.397631 -0.195234
C  -1.691874 -0.757921 -0.057108
C  -1.601986 0.66409 2.15711
C  -3.42736 -1.036896 1.812767
C  -3.940269 0.174708 -0.894423
C  -0.251285 -0.560606 -0.284722
C  -4.919097 1.076324 -1.010501
C  1.787406 -1.766175 -0.605511
C  -6.18137 0.75718 -1.751925
C  -4.856154 2.453298 -0.425199
C  2.310816 -1.190243 -1.917357
C  2.562458 -1.057155 0.473312
C  3.565339 -0.331473 -0.043367
C  3.515282 -0.377463 -1.504522
C  2.232978 -1.235628 1.906832
C  4.585822 0.457635 0.720277
C  3.978291 1.580486 1.42456
C  3.440954 2.493244 1.993383
H  -2.175996 1.35664 -0.380598
H  -2.063711 -1.732797 -0.353672
H  -0.933648 1.382184 1.687078
H  -1.008965 0.031012 2.820664
H  -2.297252 1.228918 2.780955
H  -4.186926 -0.418514 2.295653
H  -2.980449 -1.671518 2.580037
H  -3.933712 -1.686186 1.099247
H  -4.089508 -0.805072 -1.339256
H  2.017244 -2.832041 -0.543437
H  1.589281 -0.539926 -2.414959
H  2.592445 -1.96217 -2.633784
H  -6.173739 -0.253389 -2.159789
H  -7.053283 0.852949 -1.099922
H  -6.337242 1.454298 -2.57916
H  -5.704436 2.622207 0.242769
H  -3.946178 2.640544 0.142225
H  -4.927124 3.212566 -1.208166
H  1.500135 -0.488767 2.224074
H  3.110947 -1.113739 2.540258
H  1.798411 -2.216335 2.098376
H  5.094326 -0.183386 1.445691
H  5.358886 0.826085 0.042619
H  2.98678 3.310093 2.507958
elementType: O C H
totalener: -964.16055804 hartree
nucrepener: 1791.69485477 hartree
electener: -2755.85541281 hartree
oneelecener: -4868.82223625 hartree
twoeener: 2112.96682344 hartree
cpcmener: -0.04278708 hartree
kineticenergy: 959.77969976 hartree
xcener: -94.701822933643 hartree
chargesum: -0.0000000
charge: -0.299230 -0.488457 -0.487042 0.163154 -0.008571 -0.133017 -0.310110 -0.269681 -0.274611 0.413362 -0.033171 0.279503 -0.230481 -0.251481 -0.149245 0.008332 -0.130991 0.303018 -0.284073 -0.094669 -0.440539 0.012393 0.100153 0.091130 0.095376 0.099770 0.102752 0.096972 0.099051 0.092181 0.124258 0.122928 0.114994 0.109565 0.089465 0.094682 0.095300 0.096304 0.088280 0.099477 0.117817 0.119862 0.120849 0.136126 0.107808 0.290507
qa: -0.2992 -0.4885 -0.4870 0.1632 -0.0086 -0.1330 -0.3101 -0.2697 -0.2746 0.4134 -0.0332 0.2795 -0.2305 -0.2515 -0.1492 0.0083 -0.1310 0.3030 -0.2841 -0.0947 -0.4405 0.0124 0.1002 0.0911 0.0954 0.0998 0.1028 0.0970 0.0991 0.0922 0.1243 0.1229 0.1150 0.1096 0.0895 0.0947 0.0953 0.0963 0.0883 0.0995 0.1178 0.1199 0.1208 0.1361 0.1078 0.2905
va: 2.1337 2.0180 2.0124 3.6399 3.7916 3.9012 3.9048 3.9044 3.8690 4.1607 3.7009 3.7849 3.9268 3.9418 3.8759 3.6432 3.5213 4.0350 3.9383 3.8909 3.8023 3.5696 1.0238 1.0397 1.0150 0.9985 1.0031 1.0024 1.0027 1.0026 1.0065 0.9922 1.0253 1.0232 1.0078 0.9962 0.9950 0.9973 1.0079 0.9977 0.9928 0.9959 1.0056 0.9893 1.0218 0.9453
dispcorr: -0.023121290 hartree
energy: -964.183679330639
dipole: -29.80523 27.78904 -2.01618 2.47525 -4.42187 -1.94663 9.35457 -7.59800 1.75657
magnitude: 3.30755 au
magnitude: 8.40712 debye
