program: Orca
programVersion: 5.0.2
elementType: O O O C C C C C C C C C C C C C C C C C C C H H H H H H H H H H H H H H H H H H H H H H H H
charge: 0
multiplicity: 1
keywords: wb97x-d3
keywords: def2-TZVPP
keywords: def2/J RIJCOSX
keywords: DEFGRID2
keywords: scfconv7
keywords: smallprint printgap noloewdin
keywords: NOSOSCF
formula: C19H24O3
InChI: InChI=1/C19H24O3/c1-7-8-13-12(4)16(10-15(13)20)22-18(21)17-14(9-11(2)3)19(17,5)6/h1,9,14,16-17H,8,10H2,2-6H3
46 atoms
O  0.359917 -1.709524 -0.460209
O  0.31468 0.522445 -0.292509
O  4.280046 0.239242 -2.252579
C  -2.376765 -0.223292 1.213246
C  -2.670332 0.402344 -0.117465
C  -1.699588 -0.751134 -0.043418
C  -1.593076 0.568935 2.229949
C  -3.403596 -1.135767 1.836772
C  -3.959557 0.19301 -0.816013
C  -0.262041 -0.540792 -0.277525
C  -4.888907 1.125896 -1.041336
C  1.774106 -1.739963 -0.65013
C  -6.151533 0.791316 -1.775927
C  -4.774684 2.55162 -0.597489
C  2.29429 -1.122805 -1.944241
C  2.55553 -1.070656 0.449091
C  3.55565 -0.327207 -0.046839
C  3.494643 -0.316371 -1.508401
C  2.231884 -1.30157 1.876204
C  4.582324 0.432531 0.737581
C  3.986796 1.552682 1.456525
C  3.463106 2.461649 2.044535
H  -2.206299 1.373179 -0.261647
H  -2.07069 -1.712502 -0.382123
H  -0.938716 1.315578 1.784907
H  -0.984353 -0.088181 2.854784
H  -2.284683 1.096546 2.889451
H  -2.934421 -1.799534 2.565158
H  -3.915816 -1.758432 1.104261
H  -4.160312 -0.550111 2.36273
H  -4.155533 -0.815619 -1.169026
H  1.999692 -2.808157 -0.623999
H  1.568781 -0.465574 -2.426523
H  2.582715 -1.873723 -2.680298
H  -7.02912 0.973202 -1.150269
H  -6.268688 1.421639 -2.661156
H  -6.176473 -0.249629 -2.097606
H  -5.630944 2.824899 0.024584
H  -3.871756 2.758778 -0.025437
H  -4.79183 3.22783 -1.456499
H  1.469532 -0.59225 2.21293
H  3.10443 -1.164284 2.514904
H  1.833881 -2.304438 2.037171
H  5.075468 -0.229157 1.45513
H  5.366031 0.800478 0.071639
H  2.999826 3.271381 2.561774
elementType: O C H
totalener: -964.16099799 hartree
nucrepener: 1790.30213580 hartree
electener: -2754.46313379 hartree
oneelecener: -4866.02770718 hartree
twoeener: 2111.56457339 hartree
cpcmener: -0.04332610 hartree
kineticenergy: 959.77309854 hartree
xcener: -94.700580318325 hartree
chargesum: 0.0000000
charge: -0.297434 -0.488010 -0.486669 0.158149 0.014524 -0.136775 -0.304380 -0.266320 -0.288396 0.409922 -0.030520 0.276067 -0.227956 -0.253754 -0.147512 0.007922 -0.130572 0.302610 -0.282573 -0.096517 -0.443474 0.015787 0.096992 0.089579 0.094950 0.098634 0.103193 0.098666 0.090453 0.096753 0.123351 0.122686 0.114783 0.110046 0.094809 0.094326 0.089299 0.095567 0.089671 0.098166 0.119327 0.117872 0.121340 0.135978 0.108492 0.290948
qa: -0.2974 -0.4880 -0.4867 0.1581 0.0145 -0.1368 -0.3044 -0.2663 -0.2884 0.4099 -0.0305 0.2761 -0.2280 -0.2538 -0.1475 0.0079 -0.1306 0.3026 -0.2826 -0.0965 -0.4435 0.0158 0.0970 0.0896 0.0949 0.0986 0.1032 0.0987 0.0905 0.0968 0.1234 0.1227 0.1148 0.1100 0.0948 0.0943 0.0893 0.0956 0.0897 0.0982 0.1193 0.1179 0.1213 0.1360 0.1085 0.2909
va: 2.1330 2.0184 2.0129 3.6446 3.7813 3.8999 3.9065 3.9032 3.8746 4.1548 3.7088 3.7887 3.9248 3.9444 3.8747 3.6446 3.5222 4.0368 3.9375 3.8877 3.8035 3.5655 1.0265 1.0412 1.0150 0.9986 1.0030 1.0024 1.0037 1.0028 1.0071 0.9923 1.0252 1.0228 0.9962 0.9955 1.0082 0.9974 1.0079 0.9972 0.9928 0.9968 1.0047 0.9897 1.0210 0.9448
dispcorr: -0.022894379 hartree
energy: -964.183892366097
dipole: -29.51285 27.53273 -1.98012 2.01351 -4.06126 -2.04775 9.03545 -7.36140 1.67405
magnitude: 3.30403 au
magnitude: 8.39817 debye
