program: Orca
programVersion: 5.0.2
elementType: O O O C C C C C C C C C C C C C C C C C C C H H H H H H H H H H H H H H H H H H H H H H H H
charge: 0
multiplicity: 1
keywords: wb97x-d3
keywords: def2-TZVPP
keywords: def2/J RIJCOSX
keywords: DEFGRID2
keywords: scfconv7
keywords: smallprint printgap noloewdin
keywords: NOSOSCF
formula: C19H24O3
InChI: InChI=1/C19H24O3/c1-7-8-13-12(4)16(10-15(13)20)22-18(21)17-14(9-11(2)3)19(17,5)6/h1,9,14,16-17H,8,10H2,2-6H3
46 atoms
O  0.141691 -0.879831 -0.29677
O  -0.382169 -2.764158 0.790689
O  3.949279 0.491904 -2.416289
C  -2.237571 0.234509 1.386857
C  -2.555104 0.152111 -0.077765
C  -2.014277 -1.068531 0.635432
C  -1.071421 1.087695 1.822218
C  -3.362128 0.223005 2.393405
C  -3.943785 0.115579 -0.584767
C  -0.684648 -1.659411 0.395149
C  -4.484978 0.951778 -1.476874
C  1.470118 -1.32968 -0.589626
C  -5.910504 0.791055 -1.913411
C  -3.769794 2.104663 -2.111712
C  1.921407 -0.745627 -1.920647
C  2.449446 -0.796047 0.427528
C  3.42823 -0.089928 -0.157541
C  3.211762 -0.031721 -1.605136
C  2.301107 -1.090546 1.87168
C  4.594895 0.572044 0.512132
C  4.19334 1.753107 1.267048
C  3.842045 2.715462 1.896221
H  -1.840924 0.667827 -0.709912
H  -2.744101 -1.835994 0.871019
H  -0.59414 0.67568 2.713892
H  -1.430032 2.086633 2.07783
H  -0.309941 1.206372 1.054472
H  -2.994507 -0.093236 3.371288
H  -4.173461 -0.447602 2.113899
H  -3.782082 1.224408 2.507101
H  -4.575537 -0.672828 -0.18498
H  1.498552 -2.420915 -0.599923
H  1.197714 -0.029863 -2.316325
H  2.077921 -1.506576 -2.685457
H  -6.395999 -0.058719 -1.43374
H  -6.493935 1.687005 -1.685926
H  -5.974416 0.650014 -2.995579
H  -3.787017 2.016617 -3.201142
H  -4.278482 3.042338 -1.872529
H  -2.73152 2.20608 -1.801013
H  3.155396 -0.746189 2.451306
H  2.183175 -2.163228 2.033708
H  1.4089 -0.607297 2.277608
H  5.092769 -0.130113 1.185692
H  5.337362 0.856881 -0.236596
H  3.524553 3.569353 2.451585
elementType: O C H
totalener: -964.16182422 hartree
nucrepener: 1784.98953861 hartree
electener: -2749.15136283 hartree
oneelecener: -4854.30906543 hartree
twoeener: 2105.15770260 hartree
cpcmener: -0.03981721 hartree
kineticenergy: 959.76086655 hartree
xcener: -94.697111536621 hartree
chargesum: -0.0000000
charge: -0.278033 -0.495316 -0.479504 0.127467 0.066925 -0.140665 -0.306770 -0.269939 -0.305173 0.428936 -0.044584 0.210105 -0.222151 -0.253679 -0.133979 -0.016642 -0.092911 0.313082 -0.257977 -0.096331 -0.457522 0.033200 0.103319 0.091040 0.104052 0.104281 0.091549 0.098446 0.089238 0.096393 0.122651 0.113482 0.105078 0.104607 0.088819 0.093496 0.094118 0.096044 0.097357 0.088883 0.102574 0.122154 0.125696 0.135970 0.110203 0.292009
qa: -0.2780 -0.4953 -0.4795 0.1275 0.0669 -0.1407 -0.3068 -0.2699 -0.3052 0.4289 -0.0446 0.2101 -0.2222 -0.2537 -0.1340 -0.0166 -0.0929 0.3131 -0.2580 -0.0963 -0.4575 0.0332 0.1033 0.0910 0.1041 0.1043 0.0915 0.0984 0.0892 0.0964 0.1227 0.1135 0.1051 0.1046 0.0888 0.0935 0.0941 0.0960 0.0974 0.0889 0.1026 0.1222 0.1257 0.1360 0.1102 0.2920
va: 2.1197 1.9972 2.0205 3.6630 3.7324 3.9007 3.9079 3.9066 3.8508 4.1421 3.7502 3.7660 3.9223 3.9438 3.9256 3.7017 3.5215 4.0312 3.9366 3.8798 3.8236 3.5429 1.0179 1.0353 0.9951 1.0032 1.0129 1.0018 1.0053 1.0026 1.0090 1.0286 1.0258 1.0222 1.0086 0.9963 0.9960 0.9969 0.9971 1.0103 1.0038 1.0071 0.9900 0.9885 1.0203 0.9439
dispcorr: -0.022631835 hartree
energy: -964.184456053311
dipole: -25.00390 23.64835 -1.35555 8.14687 -7.93692 0.20995 4.96931 -3.93187 1.03743
magnitude: 1.71984 au
magnitude: 4.37149 debye
